BDBM21767 2-[(1S)-5-{3-[2-propyl-4-(trifluoromethyl)phenoxy]propoxy}-2,3-dihydro-1H-inden-1-yl]acetic acid::Indanylacetic Acid Analog, 17n
SMILES: CCCc1cc(ccc1OCCCOc1ccc2[C@H](CC(O)=O)CCc2c1)C(F)(F)F
InChI Key: InChIKey=UJRNVHVWFAPHHZ-KRWDZBQOSA-N
Data: 6 EC50
Activity Spreadsheet -- Enzyme Inhibition Constant Data from BindingDB
Found 6 hits for monomerid = 21767
Trg + Lig
Ki
nM
ΔG°
kcal/mole
IC50
nM
Kd
nM
EC50/IC50
nM
koff
s-1
kon
M-1s-1
pHTemp
°C
Peroxisome proliferator-activated receptor alpha
(Homo sapiens (Human))
BDBM21767
(2-[(1S)-5-{3-[2-propyl-4-(trifluoromethyl)phenoxy]...)
Show SMILES CCCc1cc(ccc1OCCCOc1ccc2[C@H](CC(O)=O)CCc2c1)C(F)(F)F |r|
Show InChI InChI=1S/C24H27F3O4/c1-2-4-18-13-19(24(25,26)27)7-10-22(18)31-12-3-11-30-20-8-9-21-16(14-20)5-6-17(21)15-23(28)29/h7-10,13-14,17H,2-6,11-12,15H2,1H3,(H,28,29)/t17-/m0/s1
n/an/an/an/a 1.14E+3n/an/a7.422
Bayer HealthCare Pharmaceuticals Corporation
Assay Description
Activity was assessed by measuring the human PPAR ligand binding domain with the co-activator protein. Europium labeled anti-GST antibody, streptavid...
J Med Chem 50: 984-1000 (2007)
Article DOI: 10.1021/jm061299k
BindingDB Entry DOI: 10.7270/Q2NK3C93
Peroxisome proliferator-activated receptor delta
(Homo sapiens (Human))
BDBM21767
(2-[(1S)-5-{3-[2-propyl-4-(trifluoromethyl)phenoxy]...)
Show SMILES CCCc1cc(ccc1OCCCOc1ccc2[C@H](CC(O)=O)CCc2c1)C(F)(F)F |r|
Show InChI InChI=1S/C24H27F3O4/c1-2-4-18-13-19(24(25,26)27)7-10-22(18)31-12-3-11-30-20-8-9-21-16(14-20)5-6-17(21)15-23(28)29/h7-10,13-14,17H,2-6,11-12,15H2,1H3,(H,28,29)/t17-/m0/s1
n/an/an/an/a 1.60n/an/an/a25
Bayer HealthCare Pharmaceuticals Corporation
Assay Description
Activity was assessed by measuring the human PPAR ligand binding domain with the co-activator protein. Europium labeled anti-GST antibody, streptavid...
J Med Chem 50: 984-1000 (2007)
Article DOI: 10.1021/jm061299k
BindingDB Entry DOI: 10.7270/Q2NK3C93
Peroxisome proliferator-activated receptor delta
(Homo sapiens (Human))
BDBM21767
(2-[(1S)-5-{3-[2-propyl-4-(trifluoromethyl)phenoxy]...)
Show SMILES CCCc1cc(ccc1OCCCOc1ccc2[C@H](CC(O)=O)CCc2c1)C(F)(F)F |r|
Show InChI InChI=1S/C24H27F3O4/c1-2-4-18-13-19(24(25,26)27)7-10-22(18)31-12-3-11-30-20-8-9-21-16(14-20)5-6-17(21)15-23(28)29/h7-10,13-14,17H,2-6,11-12,15H2,1H3,(H,28,29)/t17-/m0/s1
n/an/an/an/a 6.25E+8n/an/an/an/a
TBA
Assay Description
Agonist activity at GST-tagged Homo sapiens (human) PPARdelta ligand binding domain after 2 hr by FRET assay
Citation and Details
Article DOI: 10.1007/s00044-011-9599-z
BindingDB Entry DOI: 10.7270/Q22J6FR8
Peroxisome proliferator-activated receptor alpha
(Homo sapiens (Human))
BDBM21767
(2-[(1S)-5-{3-[2-propyl-4-(trifluoromethyl)phenoxy]...)
Show SMILES CCCc1cc(ccc1OCCCOc1ccc2[C@H](CC(O)=O)CCc2c1)C(F)(F)F |r|
Show InChI InChI=1S/C24H27F3O4/c1-2-4-18-13-19(24(25,26)27)7-10-22(18)31-12-3-11-30-20-8-9-21-16(14-20)5-6-17(21)15-23(28)29/h7-10,13-14,17H,2-6,11-12,15H2,1H3,(H,28,29)/t17-/m0/s1
n/an/an/an/a 8.77E+5n/an/an/an/a
TBA
Assay Description
Agonist activity at GST-tagged Homo sapiens (human) PPARalpha ligand binding domain after 2 hr by FRET assay
Citation and Details
Article DOI: 10.1007/s00044-011-9599-z
BindingDB Entry DOI: 10.7270/Q22J6FR8
Peroxisome proliferator-activated receptor gamma
(Homo sapiens (Human))
BDBM21767
(2-[(1S)-5-{3-[2-propyl-4-(trifluoromethyl)phenoxy]...)
Show SMILES CCCc1cc(ccc1OCCCOc1ccc2[C@H](CC(O)=O)CCc2c1)C(F)(F)F |r|
Show InChI InChI=1S/C24H27F3O4/c1-2-4-18-13-19(24(25,26)27)7-10-22(18)31-12-3-11-30-20-8-9-21-16(14-20)5-6-17(21)15-23(28)29/h7-10,13-14,17H,2-6,11-12,15H2,1H3,(H,28,29)/t17-/m0/s1
NCI pathway
Reactome pathway
n/an/an/an/a 3.31E+6n/an/an/an/a
TBA
Assay Description
Agonist activity at Homo sapiens (human) PPARgamma expressed in mouse 3T3-L1 cells incubated for 2 days followed by compound wash out measured after ...
Citation and Details
Article DOI: 10.1007/s00044-011-9599-z
BindingDB Entry DOI: 10.7270/Q22J6FR8
Peroxisome proliferator-activated receptor gamma
(Homo sapiens (Human))
BDBM21767
(2-[(1S)-5-{3-[2-propyl-4-(trifluoromethyl)phenoxy]...)
Show SMILES CCCc1cc(ccc1OCCCOc1ccc2[C@H](CC(O)=O)CCc2c1)C(F)(F)F |r|
Show InChI InChI=1S/C24H27F3O4/c1-2-4-18-13-19(24(25,26)27)7-10-22(18)31-12-3-11-30-20-8-9-21-16(14-20)5-6-17(21)15-23(28)29/h7-10,13-14,17H,2-6,11-12,15H2,1H3,(H,28,29)/t17-/m0/s1
NCI pathway
Reactome pathway
n/an/an/an/a 303n/an/an/a25
Bayer HealthCare Pharmaceuticals Corporation
Assay Description
PPAR gamma activity was assessed by using the IRBA in mouse 3T3-L1 cells. This assay measures the ability of test compound to cause an increase in th...
J Med Chem 50: 984-1000 (2007)
Article DOI: 10.1021/jm061299k
BindingDB Entry DOI: 10.7270/Q2NK3C93