null
SMILES: COc1cc(C)ccc1OCCCOc1ccc2[C@H](CC(O)=O)CCc2c1
InChI Key: InChIKey=FUAUMTGROOJWPA-KRWDZBQOSA-N
Activity Spreadsheet -- Enzyme Inhibition Constant Data from BindingDB
Found 5 hits for monomerid = 21770
Trg + Lig
Ki
nM
ΔG°
kcal/mole
IC50
nM
Kd
nM
EC50/IC50
nM
koff
s-1
kon
M-1s-1
pHTemp
°C
Peroxisome proliferator-activated receptor alpha
(Homo sapiens (Human))
BDBM21770
(2-[(1S)-5-[3-(2-methoxy-4-methylphenoxy)propoxy]-2...)
Show SMILES COc1cc(C)ccc1OCCCOc1ccc2[C@H](CC(O)=O)CCc2c1 |r|
Show InChI InChI=1S/C22H26O5/c1-15-4-9-20(21(12-15)25-2)27-11-3-10-26-18-7-8-19-16(13-18)5-6-17(19)14-22(23)24/h4,7-9,12-13,17H,3,5-6,10-11,14H2,1-2H3,(H,23,24)/t17-/m0/s1
n/an/an/an/a>1.00E+4n/an/a7.422
Bayer HealthCare Pharmaceuticals Corporation
Assay Description
Activity was assessed by measuring the human PPAR ligand binding domain with the co-activator protein. Europium labeled anti-GST antibody, streptavid...
J Med Chem 50: 984-1000 (2007)
Article DOI: 10.1021/jm061299k
BindingDB Entry DOI: 10.7270/Q2NK3C93
Peroxisome proliferator-activated receptor delta
(Homo sapiens (Human))
BDBM21770
(2-[(1S)-5-[3-(2-methoxy-4-methylphenoxy)propoxy]-2...)
Show SMILES COc1cc(C)ccc1OCCCOc1ccc2[C@H](CC(O)=O)CCc2c1 |r|
Show InChI InChI=1S/C22H26O5/c1-15-4-9-20(21(12-15)25-2)27-11-3-10-26-18-7-8-19-16(13-18)5-6-17(19)14-22(23)24/h4,7-9,12-13,17H,3,5-6,10-11,14H2,1-2H3,(H,23,24)/t17-/m0/s1
n/an/an/an/a 7.5n/an/an/a25
Bayer HealthCare Pharmaceuticals Corporation
Assay Description
Activity was assessed by measuring the human PPAR ligand binding domain with the co-activator protein. Europium labeled anti-GST antibody, streptavid...
J Med Chem 50: 984-1000 (2007)
Article DOI: 10.1021/jm061299k
BindingDB Entry DOI: 10.7270/Q2NK3C93
Peroxisome proliferator-activated receptor delta
(Homo sapiens (Human))
BDBM21770
(2-[(1S)-5-[3-(2-methoxy-4-methylphenoxy)propoxy]-2...)
Show SMILES COc1cc(C)ccc1OCCCOc1ccc2[C@H](CC(O)=O)CCc2c1 |r|
Show InChI InChI=1S/C22H26O5/c1-15-4-9-20(21(12-15)25-2)27-11-3-10-26-18-7-8-19-16(13-18)5-6-17(19)14-22(23)24/h4,7-9,12-13,17H,3,5-6,10-11,14H2,1-2H3,(H,23,24)/t17-/m0/s1
n/an/an/an/a 1.33E+8n/an/an/an/a
TBA
Assay Description
Agonist activity at GST-tagged Homo sapiens (human) PPARdelta ligand binding domain after 2 hr by FRET assay
Citation and Details
Article DOI: 10.1007/s00044-011-9599-z
BindingDB Entry DOI: 10.7270/Q22J6FR8
Peroxisome proliferator-activated receptor gamma
(Homo sapiens (Human))
BDBM21770
(2-[(1S)-5-[3-(2-methoxy-4-methylphenoxy)propoxy]-2...)
Show SMILES COc1cc(C)ccc1OCCCOc1ccc2[C@H](CC(O)=O)CCc2c1 |r|
Show InChI InChI=1S/C22H26O5/c1-15-4-9-20(21(12-15)25-2)27-11-3-10-26-18-7-8-19-16(13-18)5-6-17(19)14-22(23)24/h4,7-9,12-13,17H,3,5-6,10-11,14H2,1-2H3,(H,23,24)/t17-/m0/s1
NCI pathway
Reactome pathway
n/an/an/an/a 6.03E+5n/an/an/an/a
TBA
Assay Description
Agonist activity at Homo sapiens (human) PPARgamma expressed in mouse 3T3-L1 cells incubated for 2 days followed by compound wash out measured after ...
Citation and Details
Article DOI: 10.1007/s00044-011-9599-z
BindingDB Entry DOI: 10.7270/Q22J6FR8
Peroxisome proliferator-activated receptor gamma
(Homo sapiens (Human))
BDBM21770
(2-[(1S)-5-[3-(2-methoxy-4-methylphenoxy)propoxy]-2...)
Show SMILES COc1cc(C)ccc1OCCCOc1ccc2[C@H](CC(O)=O)CCc2c1 |r|
Show InChI InChI=1S/C22H26O5/c1-15-4-9-20(21(12-15)25-2)27-11-3-10-26-18-7-8-19-16(13-18)5-6-17(19)14-22(23)24/h4,7-9,12-13,17H,3,5-6,10-11,14H2,1-2H3,(H,23,24)/t17-/m0/s1
NCI pathway
Reactome pathway
n/an/an/an/a 1.67E+3n/an/an/a25
Bayer HealthCare Pharmaceuticals Corporation
Assay Description
PPAR gamma activity was assessed by using the IRBA in mouse 3T3-L1 cells. This assay measures the ability of test compound to cause an increase in th...
J Med Chem 50: 984-1000 (2007)
Article DOI: 10.1021/jm061299k
BindingDB Entry DOI: 10.7270/Q2NK3C93