null
SMILES: CCOc1cc(C)ccc1OCCCOc1ccc2[C@H](CC(O)=O)CCc2c1
InChI Key: InChIKey=OKYICBFIEIXCLZ-SFHVURJKSA-N
Activity Spreadsheet -- Enzyme Inhibition Constant Data from BindingDB
Found 5 hits for monomerid = 21773
Trg + Lig
Ki
nM
ΔG°
kcal/mole
IC50
nM
Kd
nM
EC50/IC50
nM
koff
s-1
kon
M-1s-1
pHTemp
°C
Peroxisome proliferator-activated receptor alpha
(Homo sapiens (Human))
BDBM21773
(2-[(1S)-5-[3-(2-ethoxy-4-methylphenoxy)propoxy]-2,...)
Show SMILES CCOc1cc(C)ccc1OCCCOc1ccc2[C@H](CC(O)=O)CCc2c1 |r|
Show InChI InChI=1S/C23H28O5/c1-3-26-22-13-16(2)5-10-21(22)28-12-4-11-27-19-8-9-20-17(14-19)6-7-18(20)15-23(24)25/h5,8-10,13-14,18H,3-4,6-7,11-12,15H2,1-2H3,(H,24,25)/t18-/m0/s1
n/an/an/an/a>1.00E+4n/an/a7.422
Bayer HealthCare Pharmaceuticals Corporation
Assay Description
Activity was assessed by measuring the human PPAR ligand binding domain with the co-activator protein. Europium labeled anti-GST antibody, streptavid...
J Med Chem 50: 984-1000 (2007)
Article DOI: 10.1021/jm061299k
BindingDB Entry DOI: 10.7270/Q2NK3C93
Peroxisome proliferator-activated receptor delta
(Homo sapiens (Human))
BDBM21773
(2-[(1S)-5-[3-(2-ethoxy-4-methylphenoxy)propoxy]-2,...)
Show SMILES CCOc1cc(C)ccc1OCCCOc1ccc2[C@H](CC(O)=O)CCc2c1 |r|
Show InChI InChI=1S/C23H28O5/c1-3-26-22-13-16(2)5-10-21(22)28-12-4-11-27-19-8-9-20-17(14-19)6-7-18(20)15-23(24)25/h5,8-10,13-14,18H,3-4,6-7,11-12,15H2,1-2H3,(H,24,25)/t18-/m0/s1
n/an/an/an/a 2.20n/an/an/a25
Bayer HealthCare Pharmaceuticals Corporation
Assay Description
Activity was assessed by measuring the human PPAR ligand binding domain with the co-activator protein. Europium labeled anti-GST antibody, streptavid...
J Med Chem 50: 984-1000 (2007)
Article DOI: 10.1021/jm061299k
BindingDB Entry DOI: 10.7270/Q2NK3C93
Peroxisome proliferator-activated receptor gamma
(Homo sapiens (Human))
BDBM21773
(2-[(1S)-5-[3-(2-ethoxy-4-methylphenoxy)propoxy]-2,...)
Show SMILES CCOc1cc(C)ccc1OCCCOc1ccc2[C@H](CC(O)=O)CCc2c1 |r|
Show InChI InChI=1S/C23H28O5/c1-3-26-22-13-16(2)5-10-21(22)28-12-4-11-27-19-8-9-20-17(14-19)6-7-18(20)15-23(24)25/h5,8-10,13-14,18H,3-4,6-7,11-12,15H2,1-2H3,(H,24,25)/t18-/m0/s1
NCI pathway
Reactome pathway
n/an/an/an/a 8.13E+5n/an/an/an/a
TBA
Assay Description
Agonist activity at Homo sapiens (human) PPARgamma expressed in mouse 3T3-L1 cells incubated for 2 days followed by compound wash out measured after ...
Citation and Details
Article DOI: 10.1007/s00044-011-9599-z
BindingDB Entry DOI: 10.7270/Q22J6FR8
Peroxisome proliferator-activated receptor delta
(Homo sapiens (Human))
BDBM21773
(2-[(1S)-5-[3-(2-ethoxy-4-methylphenoxy)propoxy]-2,...)
Show SMILES CCOc1cc(C)ccc1OCCCOc1ccc2[C@H](CC(O)=O)CCc2c1 |r|
Show InChI InChI=1S/C23H28O5/c1-3-26-22-13-16(2)5-10-21(22)28-12-4-11-27-19-8-9-20-17(14-19)6-7-18(20)15-23(24)25/h5,8-10,13-14,18H,3-4,6-7,11-12,15H2,1-2H3,(H,24,25)/t18-/m0/s1
n/an/an/an/a 4.55E+8n/an/an/an/a
TBA
Assay Description
Agonist activity at GST-tagged Homo sapiens (human) PPARdelta ligand binding domain after 2 hr by FRET assay
Citation and Details
Article DOI: 10.1007/s00044-011-9599-z
BindingDB Entry DOI: 10.7270/Q22J6FR8
Peroxisome proliferator-activated receptor gamma
(Homo sapiens (Human))
BDBM21773
(2-[(1S)-5-[3-(2-ethoxy-4-methylphenoxy)propoxy]-2,...)
Show SMILES CCOc1cc(C)ccc1OCCCOc1ccc2[C@H](CC(O)=O)CCc2c1 |r|
Show InChI InChI=1S/C23H28O5/c1-3-26-22-13-16(2)5-10-21(22)28-12-4-11-27-19-8-9-20-17(14-19)6-7-18(20)15-23(24)25/h5,8-10,13-14,18H,3-4,6-7,11-12,15H2,1-2H3,(H,24,25)/t18-/m0/s1
NCI pathway
Reactome pathway
n/an/an/an/a 1.24E+3n/an/an/a25
Bayer HealthCare Pharmaceuticals Corporation
Assay Description
PPAR gamma activity was assessed by using the IRBA in mouse 3T3-L1 cells. This assay measures the ability of test compound to cause an increase in th...
J Med Chem 50: 984-1000 (2007)
Article DOI: 10.1021/jm061299k
BindingDB Entry DOI: 10.7270/Q2NK3C93