BDBM21777 2-[(1S)-5-(3-{2-methyl-4-[3-(trifluoromethyl)-1,2,4-thiadiazol-5-yl]phenoxy}propoxy)-2,3-dihydro-1H-inden-1-yl]acetic acid::Indanylacetic Acid Analog, 17x
SMILES: Cc1cc(ccc1OCCCOc1ccc2[C@H](CC(O)=O)CCc2c1)-c1nc(ns1)C(F)(F)F
InChI Key: InChIKey=BRUFULPAONKCPM-INIZCTEOSA-N
Data: 6 EC50
Activity Spreadsheet -- Enzyme Inhibition Constant Data from BindingDB
Found 6 hits for monomerid = 21777
Trg + Lig
Ki
nM
ΔG°
kcal/mole
IC50
nM
Kd
nM
EC50/IC50
nM
koff
s-1
kon
M-1s-1
pHTemp
°C
Peroxisome proliferator-activated receptor alpha
(Homo sapiens (Human))
BDBM21777
(2-[(1S)-5-(3-{2-methyl-4-[3-(trifluoromethyl)-1,2,...)
Show SMILES Cc1cc(ccc1OCCCOc1ccc2[C@H](CC(O)=O)CCc2c1)-c1nc(ns1)C(F)(F)F |r|
Show InChI InChI=1S/C24H23F3N2O4S/c1-14-11-17(22-28-23(29-34-22)24(25,26)27)5-8-20(14)33-10-2-9-32-18-6-7-19-15(12-18)3-4-16(19)13-21(30)31/h5-8,11-12,16H,2-4,9-10,13H2,1H3,(H,30,31)/t16-/m0/s1
n/an/an/an/a 520n/an/a7.422
Bayer HealthCare Pharmaceuticals Corporation
Assay Description
Activity was assessed by measuring the human PPAR ligand binding domain with the co-activator protein. Europium labeled anti-GST antibody, streptavid...
J Med Chem 50: 984-1000 (2007)
Article DOI: 10.1021/jm061299k
BindingDB Entry DOI: 10.7270/Q2NK3C93
Peroxisome proliferator-activated receptor delta
(Homo sapiens (Human))
BDBM21777
(2-[(1S)-5-(3-{2-methyl-4-[3-(trifluoromethyl)-1,2,...)
Show SMILES Cc1cc(ccc1OCCCOc1ccc2[C@H](CC(O)=O)CCc2c1)-c1nc(ns1)C(F)(F)F |r|
Show InChI InChI=1S/C24H23F3N2O4S/c1-14-11-17(22-28-23(29-34-22)24(25,26)27)5-8-20(14)33-10-2-9-32-18-6-7-19-15(12-18)3-4-16(19)13-21(30)31/h5-8,11-12,16H,2-4,9-10,13H2,1H3,(H,30,31)/t16-/m0/s1
n/an/an/an/a 3.40n/an/an/a25
Bayer HealthCare Pharmaceuticals Corporation
Assay Description
Activity was assessed by measuring the human PPAR ligand binding domain with the co-activator protein. Europium labeled anti-GST antibody, streptavid...
J Med Chem 50: 984-1000 (2007)
Article DOI: 10.1021/jm061299k
BindingDB Entry DOI: 10.7270/Q2NK3C93
Peroxisome proliferator-activated receptor delta
(Homo sapiens (Human))
BDBM21777
(2-[(1S)-5-(3-{2-methyl-4-[3-(trifluoromethyl)-1,2,...)
Show SMILES Cc1cc(ccc1OCCCOc1ccc2[C@H](CC(O)=O)CCc2c1)-c1nc(ns1)C(F)(F)F |r|
Show InChI InChI=1S/C24H23F3N2O4S/c1-14-11-17(22-28-23(29-34-22)24(25,26)27)5-8-20(14)33-10-2-9-32-18-6-7-19-15(12-18)3-4-16(19)13-21(30)31/h5-8,11-12,16H,2-4,9-10,13H2,1H3,(H,30,31)/t16-/m0/s1
n/an/an/an/a 2.94E+8n/an/an/an/a
TBA
Assay Description
Agonist activity at GST-tagged Homo sapiens (human) PPARdelta ligand binding domain after 2 hr by FRET assay
Citation and Details
Article DOI: 10.1007/s00044-011-9599-z
BindingDB Entry DOI: 10.7270/Q22J6FR8
Peroxisome proliferator-activated receptor alpha
(Homo sapiens (Human))
BDBM21777
(2-[(1S)-5-(3-{2-methyl-4-[3-(trifluoromethyl)-1,2,...)
Show SMILES Cc1cc(ccc1OCCCOc1ccc2[C@H](CC(O)=O)CCc2c1)-c1nc(ns1)C(F)(F)F |r|
Show InChI InChI=1S/C24H23F3N2O4S/c1-14-11-17(22-28-23(29-34-22)24(25,26)27)5-8-20(14)33-10-2-9-32-18-6-7-19-15(12-18)3-4-16(19)13-21(30)31/h5-8,11-12,16H,2-4,9-10,13H2,1H3,(H,30,31)/t16-/m0/s1
n/an/an/an/a 1.92E+6n/an/an/an/a
TBA
Assay Description
Agonist activity at GST-tagged Homo sapiens (human) PPARalpha ligand binding domain after 2 hr by FRET assay
Citation and Details
Article DOI: 10.1007/s00044-011-9599-z
BindingDB Entry DOI: 10.7270/Q22J6FR8
Peroxisome proliferator-activated receptor gamma
(Homo sapiens (Human))
BDBM21777
(2-[(1S)-5-(3-{2-methyl-4-[3-(trifluoromethyl)-1,2,...)
Show SMILES Cc1cc(ccc1OCCCOc1ccc2[C@H](CC(O)=O)CCc2c1)-c1nc(ns1)C(F)(F)F |r|
Show InChI InChI=1S/C24H23F3N2O4S/c1-14-11-17(22-28-23(29-34-22)24(25,26)27)5-8-20(14)33-10-2-9-32-18-6-7-19-15(12-18)3-4-16(19)13-21(30)31/h5-8,11-12,16H,2-4,9-10,13H2,1H3,(H,30,31)/t16-/m0/s1
NCI pathway
Reactome pathway
n/an/an/an/a 6.46E+6n/an/an/an/a
TBA
Assay Description
Agonist activity at Homo sapiens (human) PPARgamma expressed in mouse 3T3-L1 cells incubated for 2 days followed by compound wash out measured after ...
Citation and Details
Article DOI: 10.1007/s00044-011-9599-z
BindingDB Entry DOI: 10.7270/Q22J6FR8
Peroxisome proliferator-activated receptor gamma
(Homo sapiens (Human))
BDBM21777
(2-[(1S)-5-(3-{2-methyl-4-[3-(trifluoromethyl)-1,2,...)
Show SMILES Cc1cc(ccc1OCCCOc1ccc2[C@H](CC(O)=O)CCc2c1)-c1nc(ns1)C(F)(F)F |r|
Show InChI InChI=1S/C24H23F3N2O4S/c1-14-11-17(22-28-23(29-34-22)24(25,26)27)5-8-20(14)33-10-2-9-32-18-6-7-19-15(12-18)3-4-16(19)13-21(30)31/h5-8,11-12,16H,2-4,9-10,13H2,1H3,(H,30,31)/t16-/m0/s1
NCI pathway
Reactome pathway
n/an/an/an/a 158n/an/an/a25
Bayer HealthCare Pharmaceuticals Corporation
Assay Description
PPAR gamma activity was assessed by using the IRBA in mouse 3T3-L1 cells. This assay measures the ability of test compound to cause an increase in th...
J Med Chem 50: 984-1000 (2007)
Article DOI: 10.1021/jm061299k
BindingDB Entry DOI: 10.7270/Q2NK3C93