BDBM21778 2-[(1S)-5-{3-[4-(thiophen-3-yl)phenoxy]propoxy}-2,3-dihydro-1H-inden-1-yl]acetic acid::Indanylacetic Acid Analog, 29a
SMILES: OC(=O)C[C@@H]1CCc2cc(OCCCOc3ccc(cc3)-c3ccsc3)ccc12
InChI Key: InChIKey=YHQDLCWZPPUBLZ-IBGZPJMESA-N
Data: 5 EC50
Activity Spreadsheet -- Enzyme Inhibition Constant Data from BindingDB
Found 5 hits for monomerid = 21778
Trg + Lig
Ki
nM
ΔG°
kcal/mole
IC50
nM
Kd
nM
EC50/IC50
nM
koff
s-1
kon
M-1s-1
pHTemp
°C
Peroxisome proliferator-activated receptor alpha
(Homo sapiens (Human))
BDBM21778
(2-[(1S)-5-{3-[4-(thiophen-3-yl)phenoxy]propoxy}-2,...)
Show SMILES OC(=O)C[C@@H]1CCc2cc(OCCCOc3ccc(cc3)-c3ccsc3)ccc12 |r|
Show InChI InChI=1S/C24H24O4S/c25-24(26)15-19-3-2-18-14-22(8-9-23(18)19)28-12-1-11-27-21-6-4-17(5-7-21)20-10-13-29-16-20/h4-10,13-14,16,19H,1-3,11-12,15H2,(H,25,26)/t19-/m0/s1
n/an/an/an/a>1.00E+4n/an/a7.422
Bayer HealthCare Pharmaceuticals Corporation
Assay Description
Activity was assessed by measuring the human PPAR ligand binding domain with the co-activator protein. Europium labeled anti-GST antibody, streptavid...
J Med Chem 50: 984-1000 (2007)
Article DOI: 10.1021/jm061299k
BindingDB Entry DOI: 10.7270/Q2NK3C93
Peroxisome proliferator-activated receptor delta
(Homo sapiens (Human))
BDBM21778
(2-[(1S)-5-{3-[4-(thiophen-3-yl)phenoxy]propoxy}-2,...)
Show SMILES OC(=O)C[C@@H]1CCc2cc(OCCCOc3ccc(cc3)-c3ccsc3)ccc12 |r|
Show InChI InChI=1S/C24H24O4S/c25-24(26)15-19-3-2-18-14-22(8-9-23(18)19)28-12-1-11-27-21-6-4-17(5-7-21)20-10-13-29-16-20/h4-10,13-14,16,19H,1-3,11-12,15H2,(H,25,26)/t19-/m0/s1
n/an/an/an/a 5.90n/an/an/a25
Bayer HealthCare Pharmaceuticals Corporation
Assay Description
Activity was assessed by measuring the human PPAR ligand binding domain with the co-activator protein. Europium labeled anti-GST antibody, streptavid...
J Med Chem 50: 984-1000 (2007)
Article DOI: 10.1021/jm061299k
BindingDB Entry DOI: 10.7270/Q2NK3C93
Peroxisome proliferator-activated receptor gamma
(Homo sapiens (Human))
BDBM21778
(2-[(1S)-5-{3-[4-(thiophen-3-yl)phenoxy]propoxy}-2,...)
Show SMILES OC(=O)C[C@@H]1CCc2cc(OCCCOc3ccc(cc3)-c3ccsc3)ccc12 |r|
Show InChI InChI=1S/C24H24O4S/c25-24(26)15-19-3-2-18-14-22(8-9-23(18)19)28-12-1-11-27-21-6-4-17(5-7-21)20-10-13-29-16-20/h4-10,13-14,16,19H,1-3,11-12,15H2,(H,25,26)/t19-/m0/s1
NCI pathway
Reactome pathway
n/an/an/an/a 1.55E+6n/an/an/an/a
TBA
Assay Description
Agonist activity at Homo sapiens (human) PPARgamma expressed in mouse 3T3-L1 cells incubated for 2 days followed by compound wash out measured after ...
Citation and Details
Article DOI: 10.1007/s00044-011-9599-z
BindingDB Entry DOI: 10.7270/Q22J6FR8
Peroxisome proliferator-activated receptor delta
(Homo sapiens (Human))
BDBM21778
(2-[(1S)-5-{3-[4-(thiophen-3-yl)phenoxy]propoxy}-2,...)
Show SMILES OC(=O)C[C@@H]1CCc2cc(OCCCOc3ccc(cc3)-c3ccsc3)ccc12 |r|
Show InChI InChI=1S/C24H24O4S/c25-24(26)15-19-3-2-18-14-22(8-9-23(18)19)28-12-1-11-27-21-6-4-17(5-7-21)20-10-13-29-16-20/h4-10,13-14,16,19H,1-3,11-12,15H2,(H,25,26)/t19-/m0/s1
n/an/an/an/a 1.69E+8n/an/an/an/a
TBA
Assay Description
Agonist activity at GST-tagged Homo sapiens (human) PPARdelta ligand binding domain after 2 hr by FRET assay
Citation and Details
Article DOI: 10.1007/s00044-011-9599-z
BindingDB Entry DOI: 10.7270/Q22J6FR8
Peroxisome proliferator-activated receptor gamma
(Homo sapiens (Human))
BDBM21778
(2-[(1S)-5-{3-[4-(thiophen-3-yl)phenoxy]propoxy}-2,...)
Show SMILES OC(=O)C[C@@H]1CCc2cc(OCCCOc3ccc(cc3)-c3ccsc3)ccc12 |r|
Show InChI InChI=1S/C24H24O4S/c25-24(26)15-19-3-2-18-14-22(8-9-23(18)19)28-12-1-11-27-21-6-4-17(5-7-21)20-10-13-29-16-20/h4-10,13-14,16,19H,1-3,11-12,15H2,(H,25,26)/t19-/m0/s1
NCI pathway
Reactome pathway
n/an/an/an/a 650n/an/an/a25
Bayer HealthCare Pharmaceuticals Corporation
Assay Description
PPAR gamma activity was assessed by using the IRBA in mouse 3T3-L1 cells. This assay measures the ability of test compound to cause an increase in th...
J Med Chem 50: 984-1000 (2007)
Article DOI: 10.1021/jm061299k
BindingDB Entry DOI: 10.7270/Q2NK3C93