BDBM220128 US9278100, 11
SMILES: CN(C)C\C=C\C(=O)N1CCC[C@@H]1Cn1nc(-c2ccc(Oc3ccccc3)cc2)c2c(C)ncnc12
InChI Key: InChIKey=UBDKHMQBZNCDSH-ZRGXPQFDSA-N
Data: 5 IC50
Activity Spreadsheet -- Enzyme Inhibition Constant Data from BindingDB
Found 5 hits for monomerid = 220128
Trg + Lig
Ki
nM
ΔG°
kcal/mole
IC50
nM
Kd
nM
EC50/IC50
nM
koff
s-1
kon
M-1s-1
pHTemp
°C
Tyrosine-protein kinase BTK
(Homo sapiens (Human))
BDBM220128
(US9278100, 11)
Show SMILES CN(C)C\C=C\C(=O)N1CCC[C@@H]1Cn1nc(-c2ccc(Oc3ccccc3)cc2)c2c(C)ncnc12 |r|
Show InChI InChI=1S/C29H32N6O2/c1-21-27-28(22-13-15-25(16-14-22)37-24-10-5-4-6-11-24)32-35(29(27)31-20-30-21)19-23-9-7-18-34(23)26(36)12-8-17-33(2)3/h4-6,8,10-16,20,23H,7,9,17-19H2,1-3H3/b12-8+/t23-/m1/s1
NCI pathway
Reactome pathway
US Patent
n/an/a 0.920n/an/an/an/an/an/a
Pharmacyclics LLC
US Patent
Assay Description
IC50s were determined using the in vitro HotSpot kinase assay (purified enzymes, 33P-ATP, an appropriate substrate and 1 uM ATP.). Reaction condition...
US Patent US9278100 (2016)
BindingDB Entry DOI: 10.7270/Q20C4TMX
Tyrosine-protein kinase ITK/TSK
(Homo sapiens (Human))
BDBM220128
(US9278100, 11)
Show SMILES CN(C)C\C=C\C(=O)N1CCC[C@@H]1Cn1nc(-c2ccc(Oc3ccccc3)cc2)c2c(C)ncnc12 |r|
Show InChI InChI=1S/C29H32N6O2/c1-21-27-28(22-13-15-25(16-14-22)37-24-10-5-4-6-11-24)32-35(29(27)31-20-30-21)19-23-9-7-18-34(23)26(36)12-8-17-33(2)3/h4-6,8,10-16,20,23H,7,9,17-19H2,1-3H3/b12-8+/t23-/m1/s1
Reactome pathway
US Patent
n/an/a 6.89E+3n/an/an/an/an/an/a
Pharmacyclics LLC
US Patent
Assay Description
IC50s were determined using the in vitro HotSpot kinase assay (purified enzymes, 33P-ATP, an appropriate substrate and 1 uM ATP.). Reaction condition...
US Patent US9278100 (2016)
BindingDB Entry DOI: 10.7270/Q20C4TMX
Tyrosine-protein kinase JAK3
(Homo sapiens (Human))
BDBM220128
(US9278100, 11)
Show SMILES CN(C)C\C=C\C(=O)N1CCC[C@@H]1Cn1nc(-c2ccc(Oc3ccccc3)cc2)c2c(C)ncnc12 |r|
Show InChI InChI=1S/C29H32N6O2/c1-21-27-28(22-13-15-25(16-14-22)37-24-10-5-4-6-11-24)32-35(29(27)31-20-30-21)19-23-9-7-18-34(23)26(36)12-8-17-33(2)3/h4-6,8,10-16,20,23H,7,9,17-19H2,1-3H3/b12-8+/t23-/m1/s1
Reactome pathway
US Patent
n/an/a>1.00E+4n/an/an/an/an/an/a
Pharmacyclics LLC
US Patent
Assay Description
IC50s were determined using the in vitro HotSpot kinase assay (purified enzymes, 33P-ATP, an appropriate substrate and 1 uM ATP.). Reaction condition...
US Patent US9278100 (2016)
BindingDB Entry DOI: 10.7270/Q20C4TMX
Tyrosine-protein kinase Lck
(Homo sapiens (Human))
BDBM220128
(US9278100, 11)
Show SMILES CN(C)C\C=C\C(=O)N1CCC[C@@H]1Cn1nc(-c2ccc(Oc3ccccc3)cc2)c2c(C)ncnc12 |r|
Show InChI InChI=1S/C29H32N6O2/c1-21-27-28(22-13-15-25(16-14-22)37-24-10-5-4-6-11-24)32-35(29(27)31-20-30-21)19-23-9-7-18-34(23)26(36)12-8-17-33(2)3/h4-6,8,10-16,20,23H,7,9,17-19H2,1-3H3/b12-8+/t23-/m1/s1
US Patent
n/an/a 2.43n/an/an/an/an/an/a
Pharmacyclics LLC
US Patent
Assay Description
IC50s were determined using the in vitro HotSpot kinase assay (purified enzymes, 33P-ATP, an appropriate substrate and 1 uM ATP.). Reaction condition...
US Patent US9278100 (2016)
BindingDB Entry DOI: 10.7270/Q20C4TMX
Epidermal growth factor receptor
(Homo sapiens (Human))
BDBM220128
(US9278100, 11)
Show SMILES CN(C)C\C=C\C(=O)N1CCC[C@@H]1Cn1nc(-c2ccc(Oc3ccccc3)cc2)c2c(C)ncnc12 |r|
Show InChI InChI=1S/C29H32N6O2/c1-21-27-28(22-13-15-25(16-14-22)37-24-10-5-4-6-11-24)32-35(29(27)31-20-30-21)19-23-9-7-18-34(23)26(36)12-8-17-33(2)3/h4-6,8,10-16,20,23H,7,9,17-19H2,1-3H3/b12-8+/t23-/m1/s1
US Patent
n/an/a 18.9n/an/an/an/an/an/a
Pharmacyclics LLC
US Patent
Assay Description
IC50s were determined using the in vitro HotSpot kinase assay (purified enzymes, 33P-ATP, an appropriate substrate and 1 uM ATP.). Reaction condition...
US Patent US9278100 (2016)
BindingDB Entry DOI: 10.7270/Q20C4TMX