BDBM222067 2-(4-(5,6-Dimethyl-1H-benzo[d]imidazol-2-yl)benzoyl)-N-(3-methoxyphenyl)hydrazinecarbothioamide (8)
SMILES: COc1cccc(NC(=S)NNC(=O)c2ccc(cc2)-c2nc3cc(C)c(C)cc3[nH]2)c1
InChI Key: InChIKey=MSLKTRWMOSUZPL-UHFFFAOYSA-N
Data: 1 IC50
Activity Spreadsheet -- Enzyme Inhibition Constant Data from BindingDB
Found 1 hit for monomerid = 222067
Trg + Lig
Ki
nM
ΔG°
kcal/mole
IC50
nM
Kd
nM
EC50/IC50
nM
koff
s-1
kon
M-1s-1
pHTemp
°C
α-glucosidase
(Saccharomyces cerevisiae S288c (Baker's yeast))
BDBM222067
(2-(4-(5,6-Dimethyl-1H-benzo[d]imidazol-2-yl)benzoy...)
Show SMILES COc1cccc(NC(=S)NNC(=O)c2ccc(cc2)-c2nc3cc(C)c(C)cc3[nH]2)c1
Show InChI InChI=1S/C24H23N5O2S/c1-14-11-20-21(12-15(14)2)27-22(26-20)16-7-9-17(10-8-16)23(30)28-29-24(32)25-18-5-4-6-19(13-18)31-3/h4-13H,1-3H3,(H,26,27)(H,28,30)(H2,25,29,32)
Reactome pathway
n/an/a 7.18E+4n/an/an/an/a6.837
Universiti Teknologi MARA (UiTM)
Assay Description
The enzyme inhibition was evaluated according to the method previously reported by Zawawi et al. [Zawawi et al., Bioorg. Chem., 23:3119] with slight ...
Bioorg Chem 70: 184-191 (2017)
Article DOI: 10.1016/j.bioorg.2016.12.009
BindingDB Entry DOI: 10.7270/Q27P8X71