BDBM223351 US9315520, 38::US9605007, Example 38::US9744173, Example 38
SMILES: C[C@H]1C[C@H]2CSC(N)=N[C@]2(CO1)c1nc(NC(=O)c2nc(C)oc2C(F)(F)F)cs1
InChI Key: InChIKey=ASVFESAYRASUCE-VNNFXVPXSA-N
Data: 3 IC50
Activity Spreadsheet -- Enzyme Inhibition Constant Data from BindingDB
Found 3 hits for monomerid = 223351
Trg + Lig
Ki
nM
ΔG°
kcal/mole
IC50
nM
Kd
nM
EC50/IC50
nM
koff
s-1
kon
M-1s-1
pHTemp
°C
Beta-secretase 1 (BACE1)
(Homo sapiens (Human))
BDBM223351
(US9315520, 38 | US9605007, Example 38 | US9744173,...)
Show SMILES C[C@H]1C[C@H]2CSC(N)=N[C@]2(CO1)c1nc(NC(=O)c2nc(C)oc2C(F)(F)F)cs1 |r,c:7|
Show InChI InChI=1S/C17H18F3N5O3S2/c1-7-3-9-4-30-15(21)25-16(9,6-27-7)14-24-10(5-29-14)23-13(26)11-12(17(18,19)20)28-8(2)22-11/h5,7,9H,3-4,6H2,1-2H3,(H2,21,25)(H,23,26)/t7-,9-,16-/m0/s1
US Patent
n/an/a 145n/an/an/an/a4.537
Pfizer Inc.
US Patent
Assay Description
The substrate is Biotin-GLTNIKTEEISEISY^EVEFR-C[Oregon Green]KK-OH. The BACE1 enzyme is affinity purified material from conditioned media of CHO-K1 c...
US Patent US9315520 (2016)
BindingDB Entry DOI: 10.7270/Q20000Z5
Beta-secretase 1
(Homo sapiens (Human))
BDBM223351
(US9315520, 38 | US9605007, Example 38 | US9744173,...)
Show SMILES C[C@H]1C[C@H]2CSC(N)=N[C@]2(CO1)c1nc(NC(=O)c2nc(C)oc2C(F)(F)F)cs1 |r,c:7|
Show InChI InChI=1S/C17H18F3N5O3S2/c1-7-3-9-4-30-15(21)25-16(9,6-27-7)14-24-10(5-29-14)23-13(26)11-12(17(18,19)20)28-8(2)22-11/h5,7,9H,3-4,6H2,1-2H3,(H2,21,25)(H,23,26)/t7-,9-,16-/m0/s1
US Patent
n/an/a 145n/an/an/an/an/an/a
Pfizer Inc.
US Patent
Assay Description
Beta-secretase (BACE) is one of the enzymes involved in the generation of the amyloid beta peptide found in the amyloid plaques of Alzheimer's Di...
US Patent US9744173 (2017)
BindingDB Entry DOI: 10.7270/Q2K076CZ
Beta-secretase 1
(Homo sapiens (Human))
BDBM223351
(US9315520, 38 | US9605007, Example 38 | US9744173,...)
Show SMILES C[C@H]1C[C@H]2CSC(N)=N[C@]2(CO1)c1nc(NC(=O)c2nc(C)oc2C(F)(F)F)cs1 |r,c:7|
Show InChI InChI=1S/C17H18F3N5O3S2/c1-7-3-9-4-30-15(21)25-16(9,6-27-7)14-24-10(5-29-14)23-13(26)11-12(17(18,19)20)28-8(2)22-11/h5,7,9H,3-4,6H2,1-2H3,(H2,21,25)(H,23,26)/t7-,9-,16-/m0/s1
US Patent
n/an/a 145n/an/an/an/an/an/a
Pfizer Inc.
US Patent
Assay Description
Beta-secretase (BACE) is one of the enzymes involved in the generation of the amyloid beta peptide found in the amyloid plaques of Alzheimer's Di...
US Patent US9605007 (2017)
BindingDB Entry DOI: 10.7270/Q2JQ133S