BDBM22455 2-Amino-1,3-thiazol-4(5H)-one, 6b::2-[(cyclohexylmethyl)amino]-5-methyl-5-propyl-4,5-dihydro-1,3-thiazol-4-one
SMILES: CCCC1(C)SC(NCC2CCCCC2)=NC1=O
InChI Key: InChIKey=QFAZDDSXCQFUSQ-UHFFFAOYSA-N
Data: 1 KI
Activity Spreadsheet -- Enzyme Inhibition Constant Data from BindingDB
Found 1 hit for monomerid = 22455
Trg + Lig
Ki
nM
ΔG°
kcal/mole
IC50
nM
Kd
nM
EC50/IC50
nM
koff
s-1
kon
M-1s-1
pHTemp
°C
11-beta-hydroxysteroid dehydrogenase 1
(Homo sapiens (Human))
BDBM22455
(2-Amino-1,3-thiazol-4(5H)-one, 6b | 2-[(cyclohexyl...)
Show SMILES CCCC1(C)SC(NCC2CCCCC2)=NC1=O |c:15|
Show InChI InChI=1S/C14H24N2OS/c1-3-9-14(2)12(17)16-13(18-14)15-10-11-7-5-4-6-8-11/h11H,3-10H2,1-2H3,(H,15,16,17)
Reactome pathway
34 -10.1n/an/an/an/an/a7.222
Biovitrum AB
Assay Description
The 11beta-HSD1 enzyme assay was carried out in the replica plates of the compounds in reaction buffer containing substrate mixture [3H]-cortisone/NA...
J Med Chem 51: 2933-43 (2008)
Article DOI: 10.1021/jm701551j
BindingDB Entry DOI: 10.7270/Q2HM56Q8