BDBM22460 2-Amino-1,3-thiazol-4(5H)-one, 5e::5-ethyl-5-methyl-2-[(2,2,3,3-tetramethylcyclopropyl)amino]-4,5-dihydro-1,3-thiazol-4-one
SMILES: CCC1(C)SC(NC2C(C)(C)C2(C)C)=NC1=O
InChI Key: InChIKey=WDCSIJCNNMQBAJ-UHFFFAOYSA-N
Data: 1 KI
Activity Spreadsheet -- Enzyme Inhibition Constant Data from BindingDB
Found 1 hit for monomerid = 22460
Trg + Lig
Ki
nM
ΔG°
kcal/mole
IC50
nM
Kd
nM
EC50/IC50
nM
koff
s-1
kon
M-1s-1
pHTemp
°C
11-beta-hydroxysteroid dehydrogenase 1
(Homo sapiens (Human))
BDBM22460
(2-Amino-1,3-thiazol-4(5H)-one, 5e | 5-ethyl-5-meth...)
Show SMILES CCC1(C)SC(NC2C(C)(C)C2(C)C)=NC1=O |c:14|
Show InChI InChI=1S/C13H22N2OS/c1-7-13(6)9(16)15-10(17-13)14-8-11(2,3)12(8,4)5/h8H,7H2,1-6H3,(H,14,15,16)
Reactome pathway
58 -9.77n/an/an/an/an/a7.222
Biovitrum AB
Assay Description
The 11beta-HSD1 enzyme assay was carried out in the replica plates of the compounds in reaction buffer containing substrate mixture [3H]-cortisone/NA...
J Med Chem 51: 2933-43 (2008)
Article DOI: 10.1021/jm701551j
BindingDB Entry DOI: 10.7270/Q2HM56Q8