BDBM22472 2-Amino-1,3-thiazol-4(5H)-one, 7b::5,5-diethyl-2-{tricyclo[3.3.1.0^{3,7}]nonan-3-ylamino}-4,5-dihydro-1,3-thiazol-4-one
SMILES: CCC1(CC)SC(NC23CC4CC2CC(C3)C4)=NC1=O
InChI Key: InChIKey=AMSJQALMTUAGIU-UHFFFAOYSA-N
Data: 1 KI  1 IC50
Activity Spreadsheet -- Enzyme Inhibition Constant Data from BindingDB
Found 2 hits for monomerid = 22472
Trg + Lig
Ki
nM
ΔG°
kcal/mole
IC50
nM
Kd
nM
EC50/IC50
nM
koff
s-1
kon
M-1s-1
pHTemp
°C
11-beta-hydroxysteroid dehydrogenase 1
(Homo sapiens (Human))
BDBM22472
(2-Amino-1,3-thiazol-4(5H)-one, 7b | 5,5-diethyl-2-...)
Show SMILES CCC1(CC)SC(NC23CC4CC2CC(C3)C4)=NC1=O |c:19,TLB:15:14:8.9:11,7:8:11:14.13.16,7:8:13:10.11.16,THB:9:8:13:10.11.16,9:10:8.15:13,15:8:11:14.13.16|
Show InChI InChI=1S/C16H24N2OS/c1-3-16(4-2)13(19)17-14(20-16)18-15-8-10-5-11(9-15)7-12(15)6-10/h10-12H,3-9H2,1-2H3,(H,17,18,19)
Reactome pathway
13 -10.6n/an/an/an/an/a7.222
Biovitrum AB
Assay Description
The 11beta-HSD1 enzyme assay was carried out in the replica plates of the compounds in reaction buffer containing substrate mixture [3H]-cortisone/NA...
J Med Chem 51: 2933-43 (2008)
Article DOI: 10.1021/jm701551j
BindingDB Entry DOI: 10.7270/Q2HM56Q8
11-beta-hydroxysteroid dehydrogenase 2
(Homo sapiens (Human))
BDBM22472
(2-Amino-1,3-thiazol-4(5H)-one, 7b | 5,5-diethyl-2-...)
Show SMILES CCC1(CC)SC(NC23CC4CC2CC(C3)C4)=NC1=O |c:19,TLB:15:14:8.9:11,7:8:11:14.13.16,7:8:13:10.11.16,THB:9:8:13:10.11.16,9:10:8.15:13,15:8:11:14.13.16|
Show InChI InChI=1S/C16H24N2OS/c1-3-16(4-2)13(19)17-14(20-16)18-15-8-10-5-11(9-15)7-12(15)6-10/h10-12H,3-9H2,1-2H3,(H,17,18,19)
n/an/a>1.00E+4n/an/an/an/an/an/a
Biovitrum AB
Assay Description
The assay was performed at room temperature in a 96-well microtiter plate containing substrate mixture [3H]cortisol/NAD+, inhibitors, and 11beta-HSD2...
J Med Chem 51: 2933-43 (2008)
Article DOI: 10.1021/jm701551j
BindingDB Entry DOI: 10.7270/Q2HM56Q8