BDBM22473 2-(hexahydro-2,5-methanopentalen-3a(1H)-ylamino)-1-thia-3-azaspiro[4.4]non-2-en-4-one::2-Amino-1,3-thiazol-4(5H)-one, 8b::2-{tricyclo[3.3.1.0^{3,7}]nonan-3-ylamino}-1-thia-3-azaspiro[4.4]non-2-en-4-one
SMILES: O=C1N=C(NC23CC4CC2CC(C3)C4)SC11CCCC1
InChI Key: InChIKey=GXHSOLWRHSMNFU-UHFFFAOYSA-N
Data: 3 KI  1 IC50
Activity Spreadsheet -- Enzyme Inhibition Constant Data from BindingDB
Found 4 hits for monomerid = 22473
Trg + Lig
Ki
nM
ΔG°
kcal/mole
IC50
nM
Kd
nM
EC50/IC50
nM
koff
s-1
kon
M-1s-1
pHTemp
°C
11-beta-hydroxysteroid dehydrogenase 1
(Homo sapiens (Human))
BDBM22473
(2-(hexahydro-2,5-methanopentalen-3a(1H)-ylamino)-1...)
Show SMILES O=C1N=C(NC23CC4CC2CC(C3)C4)SC11CCCC1 |t:2,TLB:12:11:5.6:8,4:5:8:11.10.13,4:5:10:7.8.13,THB:6:5:10:7.8.13,6:7:5.12:10,12:5:8:11.10.13|
Show InChI InChI=1S/C16H22N2OS/c19-13-16(3-1-2-4-16)20-14(17-13)18-15-8-10-5-11(9-15)7-12(15)6-10/h10-12H,1-9H2,(H,17,18,19)
Reactome pathway
3 -11.5n/an/an/an/an/a7.222
Biovitrum AB
Assay Description
The 11beta-HSD1 enzyme assay was carried out in the replica plates of the compounds in reaction buffer containing substrate mixture [3H]-cortisone/NA...
J Med Chem 51: 2933-43 (2008)
Article DOI: 10.1021/jm701551j
BindingDB Entry DOI: 10.7270/Q2HM56Q8
11-beta-hydroxysteroid dehydrogenase 1
(Mus musculus (mouse))
BDBM22473
(2-(hexahydro-2,5-methanopentalen-3a(1H)-ylamino)-1...)
Show SMILES O=C1N=C(NC23CC4CC2CC(C3)C4)SC11CCCC1 |t:2,TLB:12:11:5.6:8,4:5:8:11.10.13,4:5:10:7.8.13,THB:6:5:10:7.8.13,6:7:5.12:10,12:5:8:11.10.13|
Show InChI InChI=1S/C16H22N2OS/c19-13-16(3-1-2-4-16)20-14(17-13)18-15-8-10-5-11(9-15)7-12(15)6-10/h10-12H,1-9H2,(H,17,18,19)
Reactome pathway
120 -9.34n/an/an/an/an/a7.222
Biovitrum AB
Assay Description
Enzyme assays were performed using purified recombinant enzymes, incubating with test compound and [3H]cortisone/NADPH. After incubation, the amount ...
J Med Chem 51: 2933-43 (2008)
Article DOI: 10.1021/jm701551j
BindingDB Entry DOI: 10.7270/Q2HM56Q8
11-beta-Hydroxysteroid Dehydrogenase 1 (11-beta-HSD1)
(Rattus norvegicus (rat))
BDBM22473
(2-(hexahydro-2,5-methanopentalen-3a(1H)-ylamino)-1...)
Show SMILES O=C1N=C(NC23CC4CC2CC(C3)C4)SC11CCCC1 |t:2,TLB:12:11:5.6:8,4:5:8:11.10.13,4:5:10:7.8.13,THB:6:5:10:7.8.13,6:7:5.12:10,12:5:8:11.10.13|
Show InChI InChI=1S/C16H22N2OS/c19-13-16(3-1-2-4-16)20-14(17-13)18-15-8-10-5-11(9-15)7-12(15)6-10/h10-12H,1-9H2,(H,17,18,19)
180 -9.10n/an/an/an/an/a7.222
Biovitrum AB
Assay Description
Enzyme assays were performed using purified recombinant enzymes, incubating with test compound and [3H]cortisone/NADPH. After incubation, the amount ...
J Med Chem 51: 2933-43 (2008)
Article DOI: 10.1021/jm701551j
BindingDB Entry DOI: 10.7270/Q2HM56Q8
11-beta-hydroxysteroid dehydrogenase 2
(Homo sapiens (Human))
BDBM22473
(2-(hexahydro-2,5-methanopentalen-3a(1H)-ylamino)-1...)
Show SMILES O=C1N=C(NC23CC4CC2CC(C3)C4)SC11CCCC1 |t:2,TLB:12:11:5.6:8,4:5:8:11.10.13,4:5:10:7.8.13,THB:6:5:10:7.8.13,6:7:5.12:10,12:5:8:11.10.13|
Show InChI InChI=1S/C16H22N2OS/c19-13-16(3-1-2-4-16)20-14(17-13)18-15-8-10-5-11(9-15)7-12(15)6-10/h10-12H,1-9H2,(H,17,18,19)
n/an/a>1.00E+4n/an/an/an/an/an/a
Biovitrum AB
Assay Description
The assay was performed at room temperature in a 96-well microtiter plate containing substrate mixture [3H]cortisol/NAD+, inhibitors, and 11beta-HSD2...
J Med Chem 51: 2933-43 (2008)
Article DOI: 10.1021/jm701551j
BindingDB Entry DOI: 10.7270/Q2HM56Q8