BDBM225236 BTK inhibitor, 1
SMILES: CNC(=O)C(Cc1c[nH]c2ncccc12)NC(=O)c1n[nH]c2cccc(CNc3ccc(O)cc3Cl)c12
InChI Key:
Data: 1 IC50
Activity Spreadsheet -- Enzyme Inhibition Constant Data from BindingDB
Found 1 hit for monomerid = 225236
Trg + Lig
Ki
nM
ΔG°
kcal/mole
IC50
nM
Kd
nM
EC50/IC50
nM
koff
s-1
kon
M-1s-1
pHTemp
°C
Tyrosine-protein kinase BTK
(Homo sapiens (Human))
BDBM225236
(BTK inhibitor, 1)
Show SMILES CNC(=O)C(Cc1c[nH]c2ncccc12)NC(=O)c1n[nH]c2cccc(CNc3ccc(O)cc3Cl)c12 |w:4.4|
NCI pathway
Reactome pathway
n/an/a 2.50E+3n/an/an/an/an/a30
X-Chem Pharmaceuticals
Assay Description
The BTK time-resolved FRET-based competitive binding assay and cell-based BTK assays have been previously described.[Xu et al., J.Pharmacol. Exp. The...
Chembiochem 18: 864-871 (2017)
Article DOI: 10.1002/cbic.201600573
BindingDB Entry DOI: 10.7270/Q22J69Q5