BDBM22538 4-Benzyl-1H-imidazole derivative, 19::4-{[3-(2-phenylethynyl)phenyl]methyl}-1H-imidazole
SMILES: C(c1cnc[nH]1)c1cccc(c1)C#Cc1ccccc1
InChI Key: InChIKey=VIPAIZRIFZFESY-UHFFFAOYSA-N
Data: 1 KI
Activity Spreadsheet -- Enzyme Inhibition Constant Data from BindingDB
Found 1 hit for monomerid = 22538
Trg + Lig
Ki
nM
ΔG°
kcal/mole
IC50
nM
Kd
nM
EC50/IC50
nM
koff
s-1
kon
M-1s-1
pHTemp
°C
Histamine H3 receptor
(Homo sapiens (Human))
BDBM22538
(4-Benzyl-1H-imidazole derivative, 19 | 4-{[3-(2-ph...)
Show SMILES C(c1cnc[nH]1)c1cccc(c1)C#Cc1ccccc1
Show InChI InChI=1S/C18H14N2/c1-2-5-15(6-3-1)9-10-16-7-4-8-17(11-16)12-18-13-19-14-20-18/h1-8,11,13-14H,12H2,(H,19,20)
Reactome pathway
2 -11.9n/an/an/an/an/a7.425
VU University Amsterdam
Assay Description
Ligand displacement assays were performed on CHO cells membranes expressing hH3R. Retained radioactivity was determined by liquid scintillation count...
J Med Chem 51: 2944-53 (2008)
Article DOI: 10.1021/jm7014149
BindingDB Entry DOI: 10.7270/Q24F1P2W