BDBM22544 4-(1H-imidazol-4-ylmethyl)benzonitrile::4-Benzyl-1H-imidazole derivative, 22
SMILES: N#Cc1ccc(Cc2cnc[nH]2)cc1
InChI Key: InChIKey=HLITWGOISFFJMV-UHFFFAOYSA-N
Data: 1 KI
PDB links: 2 PDB IDs contain this monomer as substructures. 2 PDB IDs contain inhibitors having a similarity of 90% to this monomer.
Activity Spreadsheet -- Enzyme Inhibition Constant Data from BindingDB
Found 1 hit for monomerid = 22544
Trg + Lig
Ki
nM
ΔG°
kcal/mole
IC50
nM
Kd
nM
EC50/IC50
nM
koff
s-1
kon
M-1s-1
pHTemp
°C
Histamine H3 receptor
(Homo sapiens (Human))
BDBM22544
(4-(1H-imidazol-4-ylmethyl)benzonitrile | 4-Benzyl-...)
Show SMILES N#Cc1ccc(Cc2cnc[nH]2)cc1
Show InChI InChI=1S/C11H9N3/c12-6-10-3-1-9(2-4-10)5-11-7-13-8-14-11/h1-4,7-8H,5H2,(H,13,14)
Reactome pathway
813 -8.30n/an/an/an/an/a7.425
VU University Amsterdam
Assay Description
Ligand displacement assays were performed on CHO cells membranes expressing hH3R. Retained radioactivity was determined by liquid scintillation count...
J Med Chem 51: 2944-53 (2008)
Article DOI: 10.1021/jm7014149
BindingDB Entry DOI: 10.7270/Q24F1P2W