null
SMILES: Cc1cc(F)c(Nc2ccnc3Nc4ccc(CN5CCC[C@@H](N)C5)cc4NC(=O)c23)cc1O
InChI Key: InChIKey=SIFWORLXBPDHFA-MRXNPFEDSA-N
Activity Spreadsheet -- Enzyme Inhibition Constant Data from BindingDB
Found 2 hits for monomerid = 227951
Trg + Lig
Ki
nM
ΔG°
kcal/mole
IC50
nM
Kd
nM
EC50/IC50
nM
koff
s-1
kon
M-1s-1
pHTemp
°C
Platelet-derived growth factor receptor beta
(Homo sapiens (Human))
BDBM227951
(8-{[(3R)-3-Aminopiperidin-1-yl]methyl}-4-[(2-fluor...)
Show SMILES Cc1cc(F)c(Nc2ccnc3Nc4ccc(CN5CCC[C@@H](N)C5)cc4NC(=O)c23)cc1O |r|
Show InChI InChI=1S/C25H27FN6O2/c1-14-9-17(26)20(11-22(14)33)29-19-6-7-28-24-23(19)25(34)31-21-10-15(4-5-18(21)30-24)12-32-8-2-3-16(27)13-32/h4-7,9-11,16,33H,2-3,8,12-13,27H2,1H3,(H,31,34)(H2,28,29,30)/t16-/m1/s1
NCI pathway
Reactome pathway
US Patent
n/an/a 0.829n/an/an/an/a7.522
Bayer Pharma Aktiengesellschaft
US Patent
Assay Description
The kinase used was a recombinant fusion protein composed of N-terminal GST and a C-terminal fragment of human PDGFRβ (amino acids R561-L1106), expr...
US Patent US10047096 (2018)
BindingDB Entry DOI: 10.7270/Q23R0VW4
Vascular endothelial growth factor receptor 2
(Homo sapiens (Human))
BDBM227951
(8-{[(3R)-3-Aminopiperidin-1-yl]methyl}-4-[(2-fluor...)
Show SMILES Cc1cc(F)c(Nc2ccnc3Nc4ccc(CN5CCC[C@@H](N)C5)cc4NC(=O)c23)cc1O |r|
Show InChI InChI=1S/C25H27FN6O2/c1-14-9-17(26)20(11-22(14)33)29-19-6-7-28-24-23(19)25(34)31-21-10-15(4-5-18(21)30-24)12-32-8-2-3-16(27)13-32/h4-7,9-11,16,33H,2-3,8,12-13,27H2,1H3,(H,31,34)(H2,28,29,30)/t16-/m1/s1
NCI pathway
Reactome pathway
US Patent
n/an/a 1.88n/an/an/an/a7.0n/a
Bayer Pharma Aktiengesellschaft
US Patent
Assay Description
The kinase used was a recombinant fusion protein composed of N-terminal GST and a C-terminal fragment of human KDR (amino acids D807-V1356), expresse...
US Patent US10047096 (2018)
BindingDB Entry DOI: 10.7270/Q23R0VW4