null
SMILES: Cc1cc(C)cc(c1)-n1c(nc(c1-c1ccccc1)-c1ccccc1)-c1cn(nc1C1=CC2C=CC=CC2OC1=O)-c1ccccc1
InChI Key: InChIKey=ZKBJGGYNTWNAFU-UHFFFAOYSA-N
Activity Spreadsheet -- Enzyme Inhibition Constant Data from BindingDB
Found 1 hit for monomerid = 231685
Trg + Lig
Ki
nM
ΔG°
kcal/mole
IC50
nM
Kd
nM
EC50/IC50
nM
koff
s-1
kon
M-1s-1
pHTemp
°C
Alpha-glucosidase MAL32
(Saccharomyces cerevisiae (Baker's yeast))
BDBM231685
(3-(4-(1-(3,5-Dimethylphenyl)-4,5-diphenyl-1H-imida...)
Show SMILES Cc1cc(C)cc(c1)-n1c(nc(c1-c1ccccc1)-c1ccccc1)-c1cn(nc1C1=CC2C=CC=CC2OC1=O)-c1ccccc1 |c:38,40,t:35|
Show InChI InChI=1S/C41H32N4O2/c1-27-22-28(2)24-33(23-27)45-39(30-16-8-4-9-17-30)37(29-14-6-3-7-15-29)42-40(45)35-26-44(32-19-10-5-11-20-32)43-38(35)34-25-31-18-12-13-21-36(31)47-41(34)46/h3-26,31,36H,1-2H3
n/an/a 4.64E+4n/an/an/an/a6.837
Kinnaird College for Women
Assay Description
For α-glucosidase inhibition assay, α-glucosidase enzyme (Cat No. 5003-1KU Type I; isolated from Saccharomyces cereviciae) was used. Acarbo...
Bioorg Chem 73: 1-9 (2017)
Article DOI: 10.1016/j.bioorg.2017.05.009
BindingDB Entry DOI: 10.7270/Q2TD9W62