BDBM23579 (3-Phenoxybenzoylamino)benzoic acid deriv., 15::2-[(3-phenoxybenzene)amido]benzoic acid
SMILES: OC(=O)c1ccccc1NC(=O)c1cccc(Oc2ccccc2)c1
InChI Key: InChIKey=MIKJQLWATXBRIP-UHFFFAOYSA-N
Data: 2 IC50
Activity Spreadsheet -- Enzyme Inhibition Constant Data from BindingDB
Found 2 hits for monomerid = 23579
Trg + Lig
Ki
nM
ΔG°
kcal/mole
IC50
nM
Kd
nM
EC50/IC50
nM
koff
s-1
kon
M-1s-1
pHTemp
°C
beta-Ketoacyl-ACP Synthase III (FabH)
(Enterococcus faecalis)
BDBM23579
((3-Phenoxybenzoylamino)benzoic acid deriv., 15 | 2...)
Show SMILES OC(=O)c1ccccc1NC(=O)c1cccc(Oc2ccccc2)c1
Show InChI InChI=1S/C20H15NO4/c22-19(21-18-12-5-4-11-17(18)20(23)24)14-7-6-10-16(13-14)25-15-8-2-1-3-9-15/h1-13H,(H,21,22)(H,23,24)
n/an/a 2.70E+3n/an/an/an/an/an/a
Shri G.S. Institute of Technology and Science
Curated by ChEMBL
Assay Description
Inhibition of Enterococcus faecalis FabH by FabD/FabH coupled assay
Eur J Med Chem 43: 1071-80 (2008)
Article DOI: 10.1016/j.ejmech.2007.06.018
BindingDB Entry DOI: 10.7270/Q2GQ700V
beta-Ketoacyl-ACP Synthase III (FabH)
(Enterococcus faecalis)
BDBM23579
((3-Phenoxybenzoylamino)benzoic acid deriv., 15 | 2...)
Show SMILES OC(=O)c1ccccc1NC(=O)c1cccc(Oc2ccccc2)c1
Show InChI InChI=1S/C20H15NO4/c22-19(21-18-12-5-4-11-17(18)20(23)24)14-7-6-10-16(13-14)25-15-8-2-1-3-9-15/h1-13H,(H,21,22)(H,23,24)
n/an/a 2.70E+3n/an/an/an/a7.022
Quorex Pharmaceuticals Inc.
Assay Description
The potency of FabH inhibition (IC50) was determined using [3H]- or [14C]-radiolabeled substrates. This was accomplished at fixed concentrations of a...
J Med Chem 48: 1596-609 (2005)
Article DOI: 10.1021/jm049141s
BindingDB Entry DOI: 10.7270/Q22B8W9H