BDBM237228 1-(2-Bromophenyl)-1-(4-hydroxy-3-methoxybenzyl)-3-phenylthiourea (9b)
SMILES: COc1cc(CN(C(=S)Nc2ccccc2)c2ccccc2Br)ccc1O
InChI Key: InChIKey=LPQYHNHIMVSPIM-UHFFFAOYSA-N
Data: 1 IC50
Activity Spreadsheet -- Enzyme Inhibition Constant Data from BindingDB
Found 1 hit for monomerid = 237228
Trg + Lig
Ki
nM
ΔG°
kcal/mole
IC50
nM
Kd
nM
EC50/IC50
nM
koff
s-1
kon
M-1s-1
pHTemp
°C
Mitogen-activated protein kinase; ERK1/ERK2
(Homo sapiens (Human))
BDBM237228
(1-(2-Bromophenyl)-1-(4-hydroxy-3-methoxybenzyl)-3-...)
Show SMILES COc1cc(CN(C(=S)Nc2ccccc2)c2ccccc2Br)ccc1O
Show InChI InChI=1S/C21H19BrN2O2S/c1-26-20-13-15(11-12-19(20)25)14-24(18-10-6-5-9-17(18)22)21(27)23-16-7-3-2-4-8-16/h2-13,25H,14H2,1H3,(H,23,27)
NCI pathway
Reactome pathway
n/an/a 6.14E+3n/an/an/an/an/an/a
Nanjing University
Assay Description
Detection of the effect of compounds on p-MEK1/2, t-ERK1/2, pERK1/2, p-Rsk1 and p-Elk-1 activity in B16-F10 cells was performed using ELISA kits (Inv...
J Enzyme Inhib Med Chem 27: 708-14 (2012)
Article DOI: 10.3109/14756366.2011.608665
BindingDB Entry DOI: 10.7270/Q2N015FS