BDBM23932 1,3-bis(trifluoromethyl)-5-[(E)-2-[4-(trifluoromethyl)phenyl]ethenyl]benzene::trans-Stilbene Derivative, 4e
SMILES: FC(F)(F)c1ccc(\C=C\c2cc(cc(c2)C(F)(F)F)C(F)(F)F)cc1
InChI Key: InChIKey=YWZOTDCCYHOIST-OWOJBTEDSA-N
Data: 3 KI
Activity Spreadsheet -- Enzyme Inhibition Constant Data from BindingDB
Found 3 hits for monomerid = 23932
Trg + Lig
Ki
nM
ΔG°
kcal/mole
IC50
nM
Kd
nM
EC50/IC50
nM
koff
s-1
kon
M-1s-1
pHTemp
°C
Aryl Hydrocarbon Receptor (AhR)
(Oryctolagus cuniculus (rabbit))
BDBM23932
(1,3-bis(trifluoromethyl)-5-[(E)-2-[4-(trifluoromet...)
Show SMILES FC(F)(F)c1ccc(\C=C\c2cc(cc(c2)C(F)(F)F)C(F)(F)F)cc1
Show InChI InChI=1S/C17H9F9/c18-15(19,20)12-5-3-10(4-6-12)1-2-11-7-13(16(21,22)23)9-14(8-11)17(24,25)26/h1-9H/b2-1+
2.10 -11.0n/an/an/an/an/a7.64
Institut Claudius Regaud
Assay Description
Cytosols from rabbit liver were incubated with [3H]-TCDD and 12 concentrations of unlabeled test ligands. IC50 values were determined using the itera...
J Med Chem 48: 287-91 (2005)
Article DOI: 10.1021/jm0498194
BindingDB Entry DOI: 10.7270/Q2WM1BQT
Estrogen receptor
(Homo sapiens (Human))
BDBM23932
(1,3-bis(trifluoromethyl)-5-[(E)-2-[4-(trifluoromet...)
Show SMILES FC(F)(F)c1ccc(\C=C\c2cc(cc(c2)C(F)(F)F)C(F)(F)F)cc1
Show InChI InChI=1S/C17H9F9/c18-15(19,20)12-5-3-10(4-6-12)1-2-11-7-13(16(21,22)23)9-14(8-11)17(24,25)26/h1-9H/b2-1+
>1.00E+5n/an/an/an/an/an/an/an/a
Institut Claudius Regaud
Assay Description
Cytosols from MCF-7 cells expressed ER-alpha isoform were incubated with [3H]-estradiol and eight concentrations of unlabeled test ligands. IC50 val...
J Med Chem 48: 287-91 (2005)
Article DOI: 10.1021/jm0498194
BindingDB Entry DOI: 10.7270/Q2WM1BQT
Aryl hydrocarbon receptor
(Homo sapiens (Human))
BDBM23932
(1,3-bis(trifluoromethyl)-5-[(E)-2-[4-(trifluoromet...)
Show SMILES FC(F)(F)c1ccc(\C=C\c2cc(cc(c2)C(F)(F)F)C(F)(F)F)cc1
Show InChI InChI=1S/C17H9F9/c18-15(19,20)12-5-3-10(4-6-12)1-2-11-7-13(16(21,22)23)9-14(8-11)17(24,25)26/h1-9H/b2-1+
4.76E+8n/an/an/an/an/an/an/an/a
TBA
Assay Description
Binding affinity to aryl hydrocarbon receptor (unknown origin)
Citation and Details
Article DOI: 10.1007/s00044-007-9055-2
BindingDB Entry DOI: 10.7270/Q2M32ZPJ