BDBM240731 US9422261, 4-(1- phenylethyl) benzene-1,3- diol
SMILES: CC(c1ccccc1)c1ccc(O)cc1O
InChI Key: InChIKey=PQSXNIMHIHYFEE-UHFFFAOYSA-N
Data: 1 IC50
Activity Spreadsheet -- Enzyme Inhibition Constant Data from BindingDB
Found 1 hit for monomerid = 240731
Trg + Lig
Ki
nM
ΔG°
kcal/mole
IC50
nM
Kd
nM
EC50/IC50
nM
koff
s-1
kon
M-1s-1
pHTemp
°C
Tyrosinase
(Agaricus bisporus (White button mushroom))
BDBM240731
(US9422261, 4-(1- phenylethyl) benzene-1,3- diol)
Show SMILES CC(c1ccccc1)c1ccc(O)cc1O
Show InChI InChI=1S/C14H14O2/c1-10(11-5-3-2-4-6-11)13-8-7-12(15)9-14(13)16/h2-10,15-16H,1H3
US Patent
n/an/a 100n/an/an/an/a6.8n/a
PIERRE FABRE DERMO-COSMETIQUE
US Patent
Assay Description
Reader: Synergy HT program: tyrosinase 280-490 kinetics: kinetics over 45 minutes, reading at t=10 minutes, Tests in transparent 96-well plates, Phos...
US Patent US9422261 (2016)
BindingDB Entry DOI: 10.7270/Q2PG1QMS