null
SMILES: NC1CCN(CCOc2ccc(Oc3nc4ccccc4s3)cc2)CC1
InChI Key: InChIKey=RYVZYGCBFLGXIF-UHFFFAOYSA-N
Activity Spreadsheet -- Enzyme Inhibition Constant Data from BindingDB
Found 1 hit for monomerid = 24219
Trg + Lig
Ki
nM
ΔG°
kcal/mole
IC50
nM
Kd
nM
EC50/IC50
nM
koff
s-1
kon
M-1s-1
pHTemp
°C
Leukotriene A-4 hydrolase
(Homo sapiens (Human))
BDBM24219
(1-{2-[4-(1,3-benzothiazol-2-yloxy)phenoxy]ethyl}pi...)
Show SMILES NC1CCN(CCOc2ccc(Oc3nc4ccccc4s3)cc2)CC1
Show InChI InChI=1S/C20H23N3O2S/c21-15-9-11-23(12-10-15)13-14-24-16-5-7-17(8-6-16)25-20-22-18-3-1-2-4-19(18)26-20/h1-8,15H,9-14,21H2
Reactome pathway
n/an/a 66n/an/an/an/a7.422
Johnson & Johnson Pharmaceutical
Assay Description
Recombinant human LTA4H was incubated with various concentrations of test compound for 10 min at room temperature in assay buffer, and the substrate,...
J Med Chem 51: 4150-69 (2008)
Article DOI: 10.1021/jm701575k
BindingDB Entry DOI: 10.7270/Q2GB22CX