BDBM243178 (R)-N-(1-(Azepan-1-yl)propan-2-yl)-4- (5-(trifluoromethyl)-1,2,4-oxadiazol-3- yl)benzamide::US10053434, 13
SMILES: C[C@H](CN1CCCCCC1)NC(=O)c1ccc(cc1)-c1noc(n1)C(F)(F)F
InChI Key: InChIKey=IZFWXPXCTQFPQU-CYBMUJFWSA-N
Data: 1 IC50
Activity Spreadsheet -- Enzyme Inhibition Constant Data from BindingDB
Found 1 hit for monomerid = 243178
Trg + Lig
Ki
nM
ΔG°
kcal/mole
IC50
nM
Kd
nM
EC50/IC50
nM
koff
s-1
kon
M-1s-1
pHTemp
°C
HDAC4
(Homo sapiens (Human))
BDBM243178
((R)-N-(1-(Azepan-1-yl)propan-2-yl)-4- (5-(trifluor...)
Show SMILES C[C@H](CN1CCCCCC1)NC(=O)c1ccc(cc1)-c1noc(n1)C(F)(F)F |r|
Show InChI InChI=1S/C19H23F3N4O2/c1-13(12-26-10-4-2-3-5-11-26)23-17(27)15-8-6-14(7-9-15)16-24-18(28-25-16)19(20,21)22/h6-9,13H,2-5,10-12H2,1H3,(H,23,27)/t13-/m1/s1
US Patent
n/an/a 11n/an/an/an/an/an/a
CHDI FOUNDATION, INC.
US Patent
Assay Description
5 μL of each solution of 1:20 diluted compound from above was transferred to a clear bottomed, black, 384-well assay plate using the Bravo or th...
US Patent US10053434 (2018)
BindingDB Entry DOI: 10.7270/Q2MG7RJZ