null
SMILES: Cc1ccnc(Nc2cccc(c2)-c2cnc(o2)N2CCNC(=O)C22CCC2)n1
InChI Key: InChIKey=LISRCVZOHMVIHB-UHFFFAOYSA-N
Activity Spreadsheet -- Enzyme Inhibition Constant Data from BindingDB
Found 1 hit for monomerid = 243356
Trg + Lig
Ki
nM
ΔG°
kcal/mole
IC50
nM
Kd
nM
EC50/IC50
nM
koff
s-1
kon
M-1s-1
pHTemp
°C
Tyrosine-protein kinase SYK
(Homo sapiens (Human))
BDBM243356
(5-{5-[3-(4-Methyl- pyrimidin-2-ylamino)- phenyl]-o...)
Show SMILES Cc1ccnc(Nc2cccc(c2)-c2cnc(o2)N2CCNC(=O)C22CCC2)n1
Show InChI InChI=1S/C21H22N6O2/c1-14-6-9-23-19(25-14)26-16-5-2-4-15(12-16)17-13-24-20(29-17)27-11-10-22-18(28)21(27)7-3-8-21/h2,4-6,9,12-13H,3,7-8,10-11H2,1H3,(H,22,28)(H,23,25,26)
NCI pathway
Reactome pathway
US Patent
n/an/a<500n/an/an/an/a7.825
AB SCIENCE
US Patent
Assay Description
SYK kinase was purified as a full length protein in a baculovirus system near homogeneity. All kinase assays were performed with the Kinase TK (tyros...
US Patent US10053455 (2018)
BindingDB Entry DOI: 10.7270/Q27946PV