null
SMILES: ONC(=O)CCCCCCC(=O)Nc1ccc(cc1)-c1cn(CC(O)c2cccc(Br)c2)nn1
InChI Key: InChIKey=KYKYBDPQRYYVLN-UHFFFAOYSA-N
Activity Spreadsheet -- Enzyme Inhibition Constant Data from BindingDB
Found 6 hits for monomerid = 24348
Trg + Lig
Ki
nM
ΔG°
kcal/mole
IC50
nM
Kd
nM
EC50/IC50
nM
koff
s-1
kon
M-1s-1
pHTemp
°C
Histone deacetylase 1
(Homo sapiens (Human))
BDBM24348
(N-(4-{1-[2-(3-bromophenyl)-2-hydroxyethyl]-1H-1,2,...)
Show SMILES ONC(=O)CCCCCCC(=O)Nc1ccc(cc1)-c1cn(CC(O)c2cccc(Br)c2)nn1
Show InChI InChI=1S/C24H28BrN5O4/c25-19-7-5-6-18(14-19)22(31)16-30-15-21(27-29-30)17-10-12-20(13-11-17)26-23(32)8-3-1-2-4-9-24(33)28-34/h5-7,10-15,22,31,34H,1-4,8-9,16H2,(H,26,32)(H,28,33)
NCI pathway
Reactome pathway
n/an/a 69.2n/an/an/an/a7.525
University of Illinois at Chicago
Assay Description
The inhibitory effects of compounds on histone deacetylase (HDAC) activity were determined using a fluorescence-based assay with electrophoretic sepa...
J Med Chem 51: 3437-48 (2008)
Article DOI: 10.1021/jm701606b
BindingDB Entry DOI: 10.7270/Q2ZC815S
Histone deacetylase 2
(Homo sapiens (Human))
BDBM24348
(N-(4-{1-[2-(3-bromophenyl)-2-hydroxyethyl]-1H-1,2,...)
Show SMILES ONC(=O)CCCCCCC(=O)Nc1ccc(cc1)-c1cn(CC(O)c2cccc(Br)c2)nn1
Show InChI InChI=1S/C24H28BrN5O4/c25-19-7-5-6-18(14-19)22(31)16-30-15-21(27-29-30)17-10-12-20(13-11-17)26-23(32)8-3-1-2-4-9-24(33)28-34/h5-7,10-15,22,31,34H,1-4,8-9,16H2,(H,26,32)(H,28,33)
NCI pathway
Reactome pathway
n/an/a 143n/an/an/an/a7.525
University of Illinois at Chicago
Assay Description
The inhibitory effects of compounds on histone deacetylase (HDAC) activity were determined using a fluorescence-based assay with electrophoretic sepa...
J Med Chem 51: 3437-48 (2008)
Article DOI: 10.1021/jm701606b
BindingDB Entry DOI: 10.7270/Q2ZC815S
Histone deacetylase 6
(Homo sapiens (Human))
BDBM24348
(N-(4-{1-[2-(3-bromophenyl)-2-hydroxyethyl]-1H-1,2,...)
Show SMILES ONC(=O)CCCCCCC(=O)Nc1ccc(cc1)-c1cn(CC(O)c2cccc(Br)c2)nn1
Show InChI InChI=1S/C24H28BrN5O4/c25-19-7-5-6-18(14-19)22(31)16-30-15-21(27-29-30)17-10-12-20(13-11-17)26-23(32)8-3-1-2-4-9-24(33)28-34/h5-7,10-15,22,31,34H,1-4,8-9,16H2,(H,26,32)(H,28,33)
NCI pathway
Reactome pathway
n/an/a 4.40n/an/an/an/an/an/a
University of Illinois at Chicago
Assay Description
The inhibitory effects of compounds on histone deacetylase (HDAC) activity were determined using a fluorescence-based assay with electrophoretic sepa...
J Med Chem 51: 3437-48 (2008)
Article DOI: 10.1021/jm701606b
BindingDB Entry DOI: 10.7270/Q2ZC815S
Histone deacetylase 8
(Homo sapiens (Human))
BDBM24348
(N-(4-{1-[2-(3-bromophenyl)-2-hydroxyethyl]-1H-1,2,...)
Show SMILES ONC(=O)CCCCCCC(=O)Nc1ccc(cc1)-c1cn(CC(O)c2cccc(Br)c2)nn1
Show InChI InChI=1S/C24H28BrN5O4/c25-19-7-5-6-18(14-19)22(31)16-30-15-21(27-29-30)17-10-12-20(13-11-17)26-23(32)8-3-1-2-4-9-24(33)28-34/h5-7,10-15,22,31,34H,1-4,8-9,16H2,(H,26,32)(H,28,33)
NCI pathway
Reactome pathway
n/an/a 3.13E+3n/an/an/an/an/an/a
University of Illinois at Chicago
Assay Description
The inhibitory effects of compounds on histone deacetylase (HDAC) activity were determined using a fluorescence-based assay with electrophoretic sepa...
J Med Chem 51: 3437-48 (2008)
Article DOI: 10.1021/jm701606b
BindingDB Entry DOI: 10.7270/Q2ZC815S
Polyamine deacetylase HDAC10
(Homo sapiens (Human))
BDBM24348
(N-(4-{1-[2-(3-bromophenyl)-2-hydroxyethyl]-1H-1,2,...)
Show SMILES ONC(=O)CCCCCCC(=O)Nc1ccc(cc1)-c1cn(CC(O)c2cccc(Br)c2)nn1
Show InChI InChI=1S/C24H28BrN5O4/c25-19-7-5-6-18(14-19)22(31)16-30-15-21(27-29-30)17-10-12-20(13-11-17)26-23(32)8-3-1-2-4-9-24(33)28-34/h5-7,10-15,22,31,34H,1-4,8-9,16H2,(H,26,32)(H,28,33)
NCI pathway
Reactome pathway
n/an/a 86.5n/an/an/an/an/an/a
University of Illinois at Chicago
Assay Description
The inhibitory effects of compounds on histone deacetylase (HDAC) activity were determined using a fluorescence-based assay with electrophoretic sepa...
J Med Chem 51: 3437-48 (2008)
Article DOI: 10.1021/jm701606b
BindingDB Entry DOI: 10.7270/Q2ZC815S
Histone deacetylase 3
(Homo sapiens (Human))
BDBM24348
(N-(4-{1-[2-(3-bromophenyl)-2-hydroxyethyl]-1H-1,2,...)
Show SMILES ONC(=O)CCCCCCC(=O)Nc1ccc(cc1)-c1cn(CC(O)c2cccc(Br)c2)nn1
Show InChI InChI=1S/C24H28BrN5O4/c25-19-7-5-6-18(14-19)22(31)16-30-15-21(27-29-30)17-10-12-20(13-11-17)26-23(32)8-3-1-2-4-9-24(33)28-34/h5-7,10-15,22,31,34H,1-4,8-9,16H2,(H,26,32)(H,28,33)
NCI pathway
Reactome pathway
n/an/a 25.3n/an/an/an/an/an/a
University of Illinois at Chicago
Assay Description
The inhibitory effects of compounds on histone deacetylase (HDAC) activity were determined using a fluorescence-based assay with electrophoretic sepa...
J Med Chem 51: 3437-48 (2008)
Article DOI: 10.1021/jm701606b
BindingDB Entry DOI: 10.7270/Q2ZC815S