BDBM24610 1-[5,7-bis(pyridin-3-yl)-1H-1,3-benzodiazol-2-yl]-3-ethylurea::Benzimidazole urea analogue, 14
SMILES: CCNC(=O)Nc1nc2c(cc(cc2[nH]1)-c1cccnc1)-c1cccnc1
InChI Key: InChIKey=CWLNVKFAQINOMH-UHFFFAOYSA-N
Data: 3 KI
Activity Spreadsheet -- Enzyme Inhibition Constant Data from BindingDB
Found 3 hits for monomerid = 24610
Trg + Lig
Ki
nM
ΔG°
kcal/mole
IC50
nM
Kd
nM
EC50/IC50
nM
koff
s-1
kon
M-1s-1
pHTemp
°C
DNA Gyrase
(Escherichia coli (strain K12))
BDBM24610
(1-[5,7-bis(pyridin-3-yl)-1H-1,3-benzodiazol-2-yl]-...)
Show SMILES CCNC(=O)Nc1nc2c(cc(cc2[nH]1)-c1cccnc1)-c1cccnc1
Show InChI InChI=1S/C20H18N6O/c1-2-23-20(27)26-19-24-17-10-15(13-5-3-7-21-11-13)9-16(18(17)25-19)14-6-4-8-22-12-14/h3-12H,2H2,1H3,(H3,23,24,25,26,27)
6n/an/an/an/an/an/an/an/a
Vertex
Assay Description
Enzymatic hydrolysis of ATP to ADP was coupled to the conversion of NADH to NAD+. The decrease in NADH absorbance was monitored at 340 nm for 20 min ...
J Med Chem 51: 5243-63 (2008)
Article DOI: 10.1021/jm800318d
BindingDB Entry DOI: 10.7270/Q2J67F7T
DNA Gyrase
(Staphylococcus aureus)
BDBM24610
(1-[5,7-bis(pyridin-3-yl)-1H-1,3-benzodiazol-2-yl]-...)
Show SMILES CCNC(=O)Nc1nc2c(cc(cc2[nH]1)-c1cccnc1)-c1cccnc1
Show InChI InChI=1S/C20H18N6O/c1-2-23-20(27)26-19-24-17-10-15(13-5-3-7-21-11-13)9-16(18(17)25-19)14-6-4-8-22-12-14/h3-12H,2H2,1H3,(H3,23,24,25,26,27)
17 -10.8n/an/an/an/an/a7.530
Vertex
Assay Description
Enzymatic hydrolysis of ATP to ADP was coupled to the conversion of NADH to NAD+. The decrease in NADH absorbance was monitored at 340 nm for 20 min ...
J Med Chem 51: 5243-63 (2008)
Article DOI: 10.1021/jm800318d
BindingDB Entry DOI: 10.7270/Q2J67F7T
DNA Topoisomerase IV
(Escherichia coli (strain K12))
BDBM24610
(1-[5,7-bis(pyridin-3-yl)-1H-1,3-benzodiazol-2-yl]-...)
Show SMILES CCNC(=O)Nc1nc2c(cc(cc2[nH]1)-c1cccnc1)-c1cccnc1
Show InChI InChI=1S/C20H18N6O/c1-2-23-20(27)26-19-24-17-10-15(13-5-3-7-21-11-13)9-16(18(17)25-19)14-6-4-8-22-12-14/h3-12H,2H2,1H3,(H3,23,24,25,26,27)
1.30E+3n/an/an/an/an/an/an/an/a
Vertex
Assay Description
Enzymatic hydrolysis of ATP to ADP was coupled to the conversion of NADH to NAD+. The decrease in NADH absorbance was monitored at 340 nm for 20 min ...
J Med Chem 51: 5243-63 (2008)
Article DOI: 10.1021/jm800318d
BindingDB Entry DOI: 10.7270/Q2J67F7T