BDBM24633 5-[(4-aminocyclohexyl)amino]-7-(propan-2-ylamino)pyrazolo[1,5-a]pyrimidine-3-carbonitrile::5-[(trans-4-aminocyclohexyl)amino]-7-[(1-methylethyl)amino]pyrazolo[1,5-a]pyrimidine-3-carbonitrile::pyrazolo[1,5-a]pyrimidine-3-carbonitrile, 12
SMILES: CC(C)Nc1cc(N[C@H]2CC[C@H](N)CC2)nc2c(cnn12)C#N
InChI Key: InChIKey=FOESVLPZMGVWBM-JOCQHMNTSA-N
Data: 1 IC50
PDB links: 1 PDB ID matches this monomer.
Activity Spreadsheet -- Enzyme Inhibition Constant Data from BindingDB
Found 1 hit for monomerid = 24633
Trg + Lig
Ki
nM
ΔG°
kcal/mole
IC50
nM
Kd
nM
EC50/IC50
nM
koff
s-1
kon
M-1s-1
pHTemp
°C
Cyclin-Dependent Kinase 2 (CDK2)
(Homo sapiens (Human))
BDBM24633
(5-[(4-aminocyclohexyl)amino]-7-(propan-2-ylamino)p...)
Show SMILES CC(C)Nc1cc(N[C@H]2CC[C@H](N)CC2)nc2c(cnn12)C#N |r,wU:8.7,wD:11.11,(3.63,.72,;2.39,1.63,;2.55,3.16,;.98,1,;-.26,1.91,;-.1,3.44,;-1.35,4.34,;-1.19,5.87,;.15,6.64,;.25,8.18,;1.63,8.86,;2.91,8.01,;4.29,8.69,;2.81,6.47,;1.43,5.79,;-2.76,3.72,;-2.92,2.18,;-4.16,1.28,;-3.69,-.18,;-2.15,-.18,;-1.67,1.28,;-5.63,1.76,;-7.11,2.15,)|
Show InChI InChI=1S/C16H23N7/c1-10(2)20-15-7-14(21-13-5-3-12(18)4-6-13)22-16-11(8-17)9-19-23(15)16/h7,9-10,12-13,20H,3-6,18H2,1-2H3,(H,21,22)/t12-,13-
NCI pathway
Reactome pathway
n/an/a 30n/an/an/an/a7.222
Astex
Assay Description
CDK2/cyclin A activity was determined using a radiometric assay to measure the incorporation of gamma-phosphate from [gamma-33P]-ATP into histone H1....
J Med Chem 51: 4986-99 (2008)
Article DOI: 10.1021/jm800382h
BindingDB Entry DOI: 10.7270/Q24X563W
3D
3D Structure (crystal)