null
SMILES: NS(=O)(=O)c1ccc(NC(=O)c2n[nH]c3ccccc23)cc1
InChI Key: InChIKey=MNHPHKFLWAPNOV-UHFFFAOYSA-N
PDB links: 1 PDB ID matches this monomer.
Activity Spreadsheet -- Enzyme Inhibition Constant Data from BindingDB
Found 1 hit for monomerid = 24635
Trg + Lig
Ki
nM
ΔG°
kcal/mole
IC50
nM
Kd
nM
EC50/IC50
nM
koff
s-1
kon
M-1s-1
pHTemp
°C
Cyclin-A2/Cyclin-dependent kinase 2
(Homo sapiens (Human))
BDBM24635
(N-(4-sulfamoylphenyl)-1H-indazole-3-carboxamide | ...)
Show SMILES NS(=O)(=O)c1ccc(NC(=O)c2n[nH]c3ccccc23)cc1
Show InChI InChI=1S/C14H12N4O3S/c15-22(20,21)10-7-5-9(6-8-10)16-14(19)13-11-3-1-2-4-12(11)17-18-13/h1-8H,(H,16,19)(H,17,18)(H2,15,20,21)
NCI pathway
Reactome pathway
n/an/a 660n/an/an/an/a7.222
Astex
Assay Description
CDK2/cyclin A activity was determined using a radiometric assay to measure the incorporation of gamma-phosphate from [gamma-33P]-ATP into histone H1....
J Med Chem 51: 4986-99 (2008)
Article DOI: 10.1021/jm800382h
BindingDB Entry DOI: 10.7270/Q24X563W
3D
3D Structure (crystal)