BDBM24638 4-amino-N-(4-fluorophenyl)-1H-pyrazole-3-carboxamide::pyrazole amide, 17
SMILES: Nc1cn[nH]c1C(=O)Nc1ccc(F)cc1
InChI Key: InChIKey=MHDUXNMHCRWOIT-UHFFFAOYSA-N
Data: 1 IC50
PDB links: 3 PDB IDs contain this monomer as substructures. 3 PDB IDs contain inhibitors having a similarity of 90% to this monomer.
Activity Spreadsheet -- Enzyme Inhibition Constant Data from BindingDB
Found 1 hit for monomerid = 24638
Trg + Lig
Ki
nM
ΔG°
kcal/mole
IC50
nM
Kd
nM
EC50/IC50
nM
koff
s-1
kon
M-1s-1
pHTemp
°C
Cyclin-Dependent Kinase 2 (CDK2)
(Homo sapiens (Human))
BDBM24638
(4-amino-N-(4-fluorophenyl)-1H-pyrazole-3-carboxami...)
Show SMILES Nc1cn[nH]c1C(=O)Nc1ccc(F)cc1
Show InChI InChI=1S/C10H9FN4O/c11-6-1-3-7(4-2-6)14-10(16)9-8(12)5-13-15-9/h1-5H,12H2,(H,13,15)(H,14,16)
NCI pathway
Reactome pathway
n/an/a 8.50E+4n/an/an/an/a7.222
Astex
Assay Description
CDK2/cyclin A activity was determined using a radiometric assay to measure the incorporation of gamma-phosphate from [gamma-33P]-ATP into histone H1....
J Med Chem 51: 4986-99 (2008)
Article DOI: 10.1021/jm800382h
BindingDB Entry DOI: 10.7270/Q24X563W
3D
3D Structure (docked)