BDBM246490 3,5-Dimethoxybibenzyl (8)
SMILES: COc1cc(CCc2ccccc2)cc(OC)c1
InChI Key: InChIKey=PBHUJCQHJCTMDJ-UHFFFAOYSA-N
Data: 1 IC50
Activity Spreadsheet -- Enzyme Inhibition Constant Data from BindingDB
Found 1 hit for monomerid = 246490
Trg + Lig
Ki
nM
ΔG°
kcal/mole
IC50
nM
Kd
nM
EC50/IC50
nM
koff
s-1
kon
M-1s-1
pHTemp
°C
Pancreatic triacylglycerol lipase
(Sus scrofa (Pig))
BDBM246490
(3,5-Dimethoxybibenzyl (8))
Show SMILES COc1cc(CCc2ccccc2)cc(OC)c1
Show InChI InChI=1S/C16H18O2/c1-17-15-10-14(11-16(12-15)18-2)9-8-13-6-4-3-5-7-13/h3-7,10-12H,8-9H2,1-2H3
n/an/a>5.00E+4n/an/an/an/a7.437
Seoul National University
Assay Description
Various concentrations of test compound (5, 10, 25, 50 and 100 mM) were dissolved in DMSO (final culture concentration 0.1%) and 4-MU oleate and lipa...
J Enzyme Inhib Med Chem 29: 1-6 (2014)
Article DOI: 10.3109/14756366.2012.742517
BindingDB Entry DOI: 10.7270/Q2DJ5DKB