BDBM246499 (1E,4E,6E)-1,7-bis(4-hydroxyphenyl)-1,4,6-heptatrien-3-one (19)
SMILES: Oc1ccc(\C=C\C=C\C(=O)\C=C\c2ccc(O)cc2)cc1
InChI Key: InChIKey=PALMCMYYFAHUGA-BPTNNVFMSA-N
Data: 1 KI  3 IC50
Activity Spreadsheet -- Enzyme Inhibition Constant Data from BindingDB
Found 3 hits for monomerid = 246499
Trg + Lig
Ki
nM
ΔG°
kcal/mole
IC50
nM
Kd
nM
EC50/IC50
nM
koff
s-1
kon
M-1s-1
pHTemp
°C
Pancreatic triacylglycerol lipase
(Sus scrofa (Pig))
BDBM246499
((1E,4E,6E)-1,7-bis(4-hydroxyphenyl)-1,4,6-heptatri...)
Show SMILES Oc1ccc(\C=C\C=C\C(=O)\C=C\c2ccc(O)cc2)cc1
Show InChI InChI=1S/C19H16O3/c20-17(10-7-16-8-13-19(22)14-9-16)4-2-1-3-15-5-11-18(21)12-6-15/h1-14,21-22H/b3-1+,4-2+,10-7+
3.34E+3 -7.77 1.64E+4n/an/an/an/a7.437
Seoul National University
Assay Description
Various concentrations of test compound (5, 10, 25, 50 and 100 mM) were dissolved in DMSO (final culture concentration 0.1%) and 4-MU oleate and lipa...
J Enzyme Inhib Med Chem 29: 1-6 (2014)
Article DOI: 10.3109/14756366.2012.742517
BindingDB Entry DOI: 10.7270/Q2DJ5DKB
Prostaglandin G/H synthase 2
(Ovis aries (Sheep))
BDBM246499
((1E,4E,6E)-1,7-bis(4-hydroxyphenyl)-1,4,6-heptatri...)
Show SMILES Oc1ccc(\C=C\C=C\C(=O)\C=C\c2ccc(O)cc2)cc1
Show InChI InChI=1S/C19H16O3/c20-17(10-7-16-8-13-19(22)14-9-16)4-2-1-3-15-5-11-18(21)12-6-15/h1-14,21-22H/b3-1+,4-2+,10-7+
n/an/a 1.09E+4n/an/an/an/an/an/a
Seoul National University
Curated by ChEMBL
Assay Description
Inhibition of ovine COX2 by colorimetric assay
Bioorg Med Chem 17: 2689-94 (2009)
Article DOI: 10.1016/j.bmc.2009.02.057
BindingDB Entry DOI: 10.7270/Q2RF5XTR
Prostaglandin G/H synthase 1
(Ovis aries (Sheep))
BDBM246499
((1E,4E,6E)-1,7-bis(4-hydroxyphenyl)-1,4,6-heptatri...)
Show SMILES Oc1ccc(\C=C\C=C\C(=O)\C=C\c2ccc(O)cc2)cc1
Show InChI InChI=1S/C19H16O3/c20-17(10-7-16-8-13-19(22)14-9-16)4-2-1-3-15-5-11-18(21)12-6-15/h1-14,21-22H/b3-1+,4-2+,10-7+
n/an/a 1.98E+4n/an/an/an/an/an/a
Seoul National University
Curated by ChEMBL
Assay Description
Inhibition of ovine COX1 by colorimetric assay
Bioorg Med Chem 17: 2689-94 (2009)
Article DOI: 10.1016/j.bmc.2009.02.057
BindingDB Entry DOI: 10.7270/Q2RF5XTR