BDBM24652 4-N-(2-fluoro-6-methoxybenzene)-3-N-(piperidin-4-yl)-1H-pyrazole-3,4-diamido::pyrazole diamide, 31
SMILES: COc1cccc(F)c1C(=O)Nc1cn[nH]c1C(=O)NC1CCNCC1
InChI Key: InChIKey=NPPBDFFMJNUJRY-UHFFFAOYSA-N
Data: 1 IC50
Activity Spreadsheet -- Enzyme Inhibition Constant Data from BindingDB
Found 1 hit for monomerid = 24652
Trg + Lig
Ki
nM
ΔG°
kcal/mole
IC50
nM
Kd
nM
EC50/IC50
nM
koff
s-1
kon
M-1s-1
pHTemp
°C
Cyclin-A2/Cyclin-dependent kinase 2
(Homo sapiens (Human))
BDBM24652
(4-N-(2-fluoro-6-methoxybenzene)-3-N-(piperidin-4-y...)
Show SMILES COc1cccc(F)c1C(=O)Nc1cn[nH]c1C(=O)NC1CCNCC1
Show InChI InChI=1S/C17H20FN5O3/c1-26-13-4-2-3-11(18)14(13)16(24)22-12-9-20-23-15(12)17(25)21-10-5-7-19-8-6-10/h2-4,9-10,19H,5-8H2,1H3,(H,20,23)(H,21,25)(H,22,24)
NCI pathway
Reactome pathway
n/an/a 35n/an/an/an/a7.222
Astex
Assay Description
CDK2/cyclin A activity was determined using a radiometric assay to measure the incorporation of gamma-phosphate from [gamma-33P]-ATP into histone H1....
J Med Chem 51: 4986-99 (2008)
Article DOI: 10.1021/jm800382h
BindingDB Entry DOI: 10.7270/Q24X563W
3D
3D Structure (docked)