BDBM246562 3-[(2-Propyl-1H-benzimidazol-1-yl)acetyl]benzenesulfonamide (3f)
SMILES: CCCc1nc2ccccc2n1CC(=O)c1cccc(c1)S(N)(=O)=O
InChI Key: InChIKey=YALDAZBQWSMBGX-UHFFFAOYSA-N
Data: 5 Kd
Activity Spreadsheet -- Enzyme Inhibition Constant Data from BindingDB
Found 5 hits for monomerid = 246562
Trg + Lig
Ki
nM
ΔG°
kcal/mole
IC50
nM
Kd
nM
EC50/IC50
nM
koff
s-1
kon
M-1s-1
pHTemp
°C
Carbonic anhydrase 1
(Homo sapiens (Human))
BDBM246562
(3-[(2-Propyl-1H-benzimidazol-1-yl)acetyl]benzenesu...)
Show SMILES CCCc1nc2ccccc2n1CC(=O)c1cccc(c1)S(N)(=O)=O
Show InChI InChI=1S/C18H19N3O3S/c1-2-6-18-20-15-9-3-4-10-16(15)21(18)12-17(22)13-7-5-8-14(11-13)25(19,23)24/h3-5,7-11H,2,6,12H2,1H3,(H2,19,23,24)
NCI pathway
Reactome pathway
n/an/an/a 1.00E+3n/an/an/a7.0n/a
Vilnius University
Assay Description
The thermal shift assay (TSA) measurements were performed in a Corbett Rotor-Gene 6000 (QIAGEN Rotor-Gene Q, Sydney, Australia) instrument using the ...
J Enzyme Inhib Med Chem 29: 124-31 (2014)
Article DOI: 10.3109/14756366.2012.757223
BindingDB Entry DOI: 10.7270/Q2RV0MMK
Carbonic anhydrase 2
(Homo sapiens (Human))
BDBM246562
(3-[(2-Propyl-1H-benzimidazol-1-yl)acetyl]benzenesu...)
Show SMILES CCCc1nc2ccccc2n1CC(=O)c1cccc(c1)S(N)(=O)=O
Show InChI InChI=1S/C18H19N3O3S/c1-2-6-18-20-15-9-3-4-10-16(15)21(18)12-17(22)13-7-5-8-14(11-13)25(19,23)24/h3-5,7-11H,2,6,12H2,1H3,(H2,19,23,24)
Reactome pathway
n/an/an/a 6.67E+3n/an/an/a7.0n/a
Vilnius University
Assay Description
The thermal shift assay (TSA) measurements were performed in a Corbett Rotor-Gene 6000 (QIAGEN Rotor-Gene Q, Sydney, Australia) instrument using the ...
J Enzyme Inhib Med Chem 29: 124-31 (2014)
Article DOI: 10.3109/14756366.2012.757223
BindingDB Entry DOI: 10.7270/Q2RV0MMK
Carbonic anhydrase 13
(Homo sapiens (Human))
BDBM246562
(3-[(2-Propyl-1H-benzimidazol-1-yl)acetyl]benzenesu...)
Show SMILES CCCc1nc2ccccc2n1CC(=O)c1cccc(c1)S(N)(=O)=O
Show InChI InChI=1S/C18H19N3O3S/c1-2-6-18-20-15-9-3-4-10-16(15)21(18)12-17(22)13-7-5-8-14(11-13)25(19,23)24/h3-5,7-11H,2,6,12H2,1H3,(H2,19,23,24)
n/an/an/a 1.00E+3n/an/an/a7.0n/a
Vilnius University
Assay Description
The thermal shift assay (TSA) measurements were performed in a Corbett Rotor-Gene 6000 (QIAGEN Rotor-Gene Q, Sydney, Australia) instrument using the ...
J Enzyme Inhib Med Chem 29: 124-31 (2014)
Article DOI: 10.3109/14756366.2012.757223
BindingDB Entry DOI: 10.7270/Q2RV0MMK
Carbonic anhydrase 12
(Homo sapiens (Human))
BDBM246562
(3-[(2-Propyl-1H-benzimidazol-1-yl)acetyl]benzenesu...)
Show SMILES CCCc1nc2ccccc2n1CC(=O)c1cccc(c1)S(N)(=O)=O
Show InChI InChI=1S/C18H19N3O3S/c1-2-6-18-20-15-9-3-4-10-16(15)21(18)12-17(22)13-7-5-8-14(11-13)25(19,23)24/h3-5,7-11H,2,6,12H2,1H3,(H2,19,23,24)
Reactome pathway
n/an/an/a 1.11E+4n/an/an/a7.0n/a
Vilnius University
Assay Description
The thermal shift assay (TSA) measurements were performed in a Corbett Rotor-Gene 6000 (QIAGEN Rotor-Gene Q, Sydney, Australia) instrument using the ...
J Enzyme Inhib Med Chem 29: 124-31 (2014)
Article DOI: 10.3109/14756366.2012.757223
BindingDB Entry DOI: 10.7270/Q2RV0MMK
Carbonic anhydrase 7
(Homo sapiens (Human))
BDBM246562
(3-[(2-Propyl-1H-benzimidazol-1-yl)acetyl]benzenesu...)
Show SMILES CCCc1nc2ccccc2n1CC(=O)c1cccc(c1)S(N)(=O)=O
Show InChI InChI=1S/C18H19N3O3S/c1-2-6-18-20-15-9-3-4-10-16(15)21(18)12-17(22)13-7-5-8-14(11-13)25(19,23)24/h3-5,7-11H,2,6,12H2,1H3,(H2,19,23,24)
Reactome pathway
n/an/an/a 2.50E+4n/an/an/a7.0n/a
Vilnius University
Assay Description
The thermal shift assay (TSA) measurements were performed in a Corbett Rotor-Gene 6000 (QIAGEN Rotor-Gene Q, Sydney, Australia) instrument using the ...
J Enzyme Inhib Med Chem 29: 124-31 (2014)
Article DOI: 10.3109/14756366.2012.757223
BindingDB Entry DOI: 10.7270/Q2RV0MMK