BDBM24783 4H-chromen-4-one::chromone, 12
SMILES: O=c1ccoc2ccccc12
InChI Key: InChIKey=OTAFHZMPRISVEM-UHFFFAOYSA-N
Data: 2 IC50  1 Other
PDB links: 63 PDB IDs contain this monomer as substructures. 63 PDB IDs contain inhibitors having a similarity of 90% to this monomer.
Activity Spreadsheet -- Enzyme Inhibition Constant Data from BindingDB
Found 5 hits for monomerid = 24783
Trg + Lig
Ki
nM
ΔG°
kcal/mole
IC50
nM
Kd
nM
EC50/IC50
nM
koff
s-1
kon
M-1s-1
pHTemp
°C
Indoleamine 2,3-dioxygenase
(Homo sapiens (Human))
BDBM24783
(4H-chromen-4-one | chromone, 12)
Show SMILES O=c1ccoc2ccccc12
Show InChI InChI=1S/C9H6O2/c10-8-5-6-11-9-4-2-1-3-7(8)9/h1-6H
Reactome pathway
n/an/an/an/an/an/an/a6.537
Bryn Mawr College
Assay Description
The IC50 inhibition assays were performed in a 96-well microtiter plate format using purified recombinant IDO, which was added to the substrate, L-tr...
J Med Chem 51: 1706-18 (2008)
Article DOI: 10.1021/jm7014155
BindingDB Entry DOI: 10.7270/Q2VD6WSV
Amine oxidase [flavin-containing] B
(Homo sapiens (Human))
BDBM24783
(4H-chromen-4-one | chromone, 12)
Show SMILES O=c1ccoc2ccccc12
Show InChI InChI=1S/C9H6O2/c10-8-5-6-11-9-4-2-1-3-7(8)9/h1-6H
n/an/a 5.49E+4n/an/an/an/an/an/a
North-West University
Curated by ChEMBL
Assay Description
Inhibition of recombinant human MAO-B assessed as inhibition of kynuramine to 4-hydroxyquinoline conversion after 20 mins by fluorometry
Bioorg Med Chem Lett 22: 5480-4 (2012)
Article DOI: 10.1016/j.bmcl.2012.07.025
BindingDB Entry DOI: 10.7270/Q2R212F5
Alpha-mannosidase
(Canavalia ensiformis)
BDBM24783
(4H-chromen-4-one | chromone, 12)
Show SMILES O=c1ccoc2ccccc12
Show InChI InChI=1S/C9H6O2/c10-8-5-6-11-9-4-2-1-3-7(8)9/h1-6H
n/an/a 4.90E+4n/an/an/an/an/an/a
TBA
Citation and Details
Alpha-L-fucosidase 1
(Bos taurus)
BDBM24783
(4H-chromen-4-one | chromone, 12)
Show SMILES O=c1ccoc2ccccc12
Show InChI InChI=1S/C9H6O2/c10-8-5-6-11-9-4-2-1-3-7(8)9/h1-6H
n/an/a 5.40E+4n/an/an/an/an/an/a
TBA
Citation and Details
Amine oxidase (flavin-containing) A
(Homo sapiens (Human))
BDBM24783
(4H-chromen-4-one | chromone, 12)
Show SMILES O=c1ccoc2ccccc12
Show InChI InChI=1S/C9H6O2/c10-8-5-6-11-9-4-2-1-3-7(8)9/h1-6H
n/an/a 3.99E+4n/an/an/an/an/an/a
North-West University
Curated by ChEMBL
Assay Description
Inhibition of recombinant human MAO-A assessed as inhibition of kynuramine to 4-hydroxyquinoline conversion after 20 mins by fluorometry
Bioorg Med Chem Lett 22: 5480-4 (2012)
Article DOI: 10.1016/j.bmcl.2012.07.025
BindingDB Entry DOI: 10.7270/Q2R212F5