BDBM2485 2-(cyclopentylamino)-6-[(2,6-difluorophenyl)methyl]-3,4-dihydropyrimidin-4-one::2-Cyclopentylamino-6-(2,6-difluorophenylmethyl)-3,4-dihydropyrimidin-4(3H)-one::F2-NH-DABO 9a
SMILES: Fc1cccc(F)c1Cc1cc(=O)[nH]c(NC2CCCC2)n1
InChI Key: InChIKey=KBEMBRRTXOGSLG-UHFFFAOYSA-N
Data: 2 IC50
Activity Spreadsheet -- Enzyme Inhibition Constant Data from BindingDB
Found 2 hits for monomerid = 2485
Trg + Lig
Ki
nM
ΔG°
kcal/mole
IC50
nM
Kd
nM
EC50/IC50
nM
koff
s-1
kon
M-1s-1
pHTemp
°C
Human immunodeficiency virus type 1 reverse transcriptase
(Human immunodeficiency virus 1)
BDBM2485
(2-(cyclopentylamino)-6-[(2,6-difluorophenyl)methyl...)
Show SMILES Fc1cccc(F)c1Cc1cc(=O)[nH]c(NC2CCCC2)n1
Show InChI InChI=1S/C16H17F2N3O/c17-13-6-3-7-14(18)12(13)8-11-9-15(22)21-16(20-11)19-10-4-1-2-5-10/h3,6-7,9-10H,1-2,4-5,8H2,(H2,19,20,21,22)
n/an/a 70n/an/an/an/an/an/a
Universita degli Studi di Roma La Sapienza
Assay Description
Inhibitory concentration required to inhibit the HIV-1 reverse transcriptase activity
J Med Chem 47: 928-34 (2004)
Article DOI: 10.1021/jm0309856
BindingDB Entry DOI: 10.7270/Q26W988R
HIV-1 Reverse Transcriptase
(Human immunodeficiency virus type 1)
BDBM2485
(2-(cyclopentylamino)-6-[(2,6-difluorophenyl)methyl...)
Show SMILES Fc1cccc(F)c1Cc1cc(=O)[nH]c(NC2CCCC2)n1
Show InChI InChI=1S/C16H17F2N3O/c17-13-6-3-7-14(18)12(13)8-11-9-15(22)21-16(20-11)19-10-4-1-2-5-10/h3,6-7,9-10H,1-2,4-5,8H2,(H2,19,20,21,22)
n/an/a 70n/an/an/an/a7.837
Universita degli Studi di Roma La Sapienza
Assay Description
The IC50 of reverse transcriptase is the concentration that inhibits 50% of recombinant HIV-1 RT RNA-directed DNA polymerase activity in vitro.
J Med Chem 47: 928-34 (2004)
Article DOI: 10.1021/jm0309856
BindingDB Entry DOI: 10.7270/Q26W988R