BDBM25063 4-[(3-oxo-6-{[(5Z)-4-oxo-2-sulfanylidene-1,3-thiazolidin-5-ylidene]methyl}-3,4-dihydro-2H-1,4-benzoxazin-4-yl)methyl]benzonitrile::benzo[1,4]oxazin-3-one, 10e
SMILES: O=C1NC(=S)S\C1=C/c1ccc2OCC(=O)N(Cc3ccc(cc3)C#N)c2c1
InChI Key: InChIKey=NGMZGAYDAAMLIH-IUXPMGMMSA-N
Data: 2 IC50
Activity Spreadsheet -- Enzyme Inhibition Constant Data from BindingDB
Found 2 hits for monomerid = 25063
Trg + Lig
Ki
nM
ΔG°
kcal/mole
IC50
nM
Kd
nM
EC50/IC50
nM
koff
s-1
kon
M-1s-1
pHTemp
°C
Phosphatidylinositol 4,5-bisphosphate 3-kinase catalytic subunit gamma isoform
(Homo sapiens (Human))
BDBM25063
(4-[(3-oxo-6-{[(5Z)-4-oxo-2-sulfanylidene-1,3-thiaz...)
Show SMILES O=C1NC(=S)S\C1=C/c1ccc2OCC(=O)N(Cc3ccc(cc3)C#N)c2c1
Show InChI InChI=1S/C20H13N3O3S2/c21-9-12-1-3-13(4-2-12)10-23-15-7-14(5-6-16(15)26-11-18(23)24)8-17-19(25)22-20(27)28-17/h1-8H,10-11H2,(H,22,25,27)/b17-8-
NCI pathway
Reactome pathway
n/an/a 152n/an/an/an/an/an/a
The University of Jordan
Curated by ChEMBL
Assay Description
Inhibition of PI3Kgamma (unknown origin) assessed as decrease in fluorescence intensity using phosphorylated substrate
Eur J Med Chem 84: 454-65 (2014)
Article DOI: 10.1016/j.ejmech.2014.07.056
BindingDB Entry DOI: 10.7270/Q2057HM8
Phosphatidylinositol 4,5-bisphosphate 3-kinase catalytic subunit gamma isoform/Phosphoinositide 3-kinase regulatory subunit 5
(Homo sapiens (Human))
BDBM25063
(4-[(3-oxo-6-{[(5Z)-4-oxo-2-sulfanylidene-1,3-thiaz...)
Show SMILES O=C1NC(=S)S\C1=C/c1ccc2OCC(=O)N(Cc3ccc(cc3)C#N)c2c1
Show InChI InChI=1S/C20H13N3O3S2/c21-9-12-1-3-13(4-2-12)10-23-15-7-14(5-6-16(15)26-11-18(23)24)8-17-19(25)22-20(27)28-17/h1-8H,10-11H2,(H,22,25,27)/b17-8-
NCI pathway
Reactome pathway
n/an/a 36.1n/an/an/an/a7.430
Pfizer
Assay Description
PI3Kgamma activity was assessed by incubation of baculoviral co-expressed regulatory and catalytic subunits (p101 and p110) with lipid micelles prepa...
Bioorg Med Chem Lett 17: 756-60 (2007)
Article DOI: 10.1016/j.bmcl.2006.10.080
BindingDB Entry DOI: 10.7270/Q2NS0S6N