BDBM251685 US10100018, Example 21::US9464060, 21
SMILES: OC(=O)c1ccc(CN(CCCCc2ccccc2)C(=O)c2ccc(Oc3ccccc3F)cc2)cc1
InChI Key: InChIKey=BKRGCMOFALKWJU-UHFFFAOYSA-N
Data: 2 IC50
Activity Spreadsheet -- Enzyme Inhibition Constant Data from BindingDB
Found 2 hits for monomerid = 251685
Trg + Lig
Ki
nM
ΔG°
kcal/mole
IC50
nM
Kd
nM
EC50/IC50
nM
koff
s-1
kon
M-1s-1
pHTemp
°C
Lysophosphatidic acid receptor 1
(Homo sapiens (Human))
BDBM251685
(US10100018, Example 21 | US9464060, 21)
Show SMILES OC(=O)c1ccc(CN(CCCCc2ccccc2)C(=O)c2ccc(Oc3ccccc3F)cc2)cc1
Show InChI InChI=1S/C31H28FNO4/c32-28-11-4-5-12-29(28)37-27-19-17-25(18-20-27)30(34)33(21-7-6-10-23-8-2-1-3-9-23)22-24-13-15-26(16-14-24)31(35)36/h1-5,8-9,11-20H,6-7,10,21-22H2,(H,35,36)
US Patent
n/an/a 11n/an/an/an/an/a25
Takeda Pharmaceutical Company Limited
US Patent
Assay Description
Engagement of the LPA1 receptor by its ligand, oleoyl-L-α-lysophosphatidic acid (LPA), leads to the release of intracellular stores of calcium i...
US Patent US10100018 (2018)
BindingDB Entry DOI: 10.7270/Q2PR7Z0N
Lysophosphatidic acid receptor 5 (LPA5)
(Homo sapiens (Human))
BDBM251685
(US10100018, Example 21 | US9464060, 21)
Show SMILES OC(=O)c1ccc(CN(CCCCc2ccccc2)C(=O)c2ccc(Oc3ccccc3F)cc2)cc1
Show InChI InChI=1S/C31H28FNO4/c32-28-11-4-5-12-29(28)37-27-19-17-25(18-20-27)30(34)33(21-7-6-10-23-8-2-1-3-9-23)22-24-13-15-26(16-14-24)31(35)36/h1-5,8-9,11-20H,6-7,10,21-22H2,(H,35,36)
US Patent
n/an/a 11n/an/an/an/an/a37
Takeda Pharmaceutical Company Limited
US Patent
Assay Description
Engagement of the LPA5 receptor by its ligand, oleoyl-L-α-lysophosphatidic acid (LPA), leads to the release of intracellular stores of calcium into ...
US Patent US9464060 (2016)
BindingDB Entry DOI: 10.7270/Q23R0RT0