BDBM25471 N-[4-(pyridin-4-yl)phenyl]-2,3-dihydro-1,4-benzodioxine-2-carboxamide::pyridine-phenyl, 2
SMILES: O=C(Nc1ccc(cc1)-c1ccncc1)C1COc2ccccc2O1
InChI Key: InChIKey=WFRVZENQQASYRN-UHFFFAOYSA-N
Data: 4 IC50
Activity Spreadsheet -- Enzyme Inhibition Constant Data from BindingDB
Found 4 hits for monomerid = 25471
Trg + Lig
Ki
nM
ΔG°
kcal/mole
IC50
nM
Kd
nM
EC50/IC50
nM
koff
s-1
kon
M-1s-1
pHTemp
°C
Rho-kinase (ROCK II)
(Homo sapiens (Human))
BDBM25471
(N-[4-(pyridin-4-yl)phenyl]-2,3-dihydro-1,4-benzodi...)
Show SMILES O=C(Nc1ccc(cc1)-c1ccncc1)C1COc2ccccc2O1
Show InChI InChI=1S/C20H16N2O3/c23-20(19-13-24-17-3-1-2-4-18(17)25-19)22-16-7-5-14(6-8-16)15-9-11-21-12-10-15/h1-12,19H,13H2,(H,22,23)
n/an/a 46n/an/an/an/a7.022
The Scripps Research Institute
Assay Description
Assays were performed using the STK2 kinase system from Cisbio. Reaction mixture containing STK2 substrate, ATP and test compound was added to the we...
J Med Chem 51: 6642-5 (2008)
Article DOI: 10.1021/jm800986w
BindingDB Entry DOI: 10.7270/Q2JS9NRN
RAC-alpha serine/threonine-protein kinase
(Homo sapiens (Human))
BDBM25471
(N-[4-(pyridin-4-yl)phenyl]-2,3-dihydro-1,4-benzodi...)
Show SMILES O=C(Nc1ccc(cc1)-c1ccncc1)C1COc2ccccc2O1
Show InChI InChI=1S/C20H16N2O3/c23-20(19-13-24-17-3-1-2-4-18(17)25-19)22-16-7-5-14(6-8-16)15-9-11-21-12-10-15/h1-12,19H,13H2,(H,22,23)
n/an/a 6.44E+3n/an/an/an/a7.322
The Scripps Research Institute
Assay Description
The mixture of a S6-peptide, ATP, and test compound was added to the wells using a BioRAPTR FRD Workstation (Aurora Discovery). Reaction was started ...
J Med Chem 51: 6642-5 (2008)
Article DOI: 10.1021/jm800986w
BindingDB Entry DOI: 10.7270/Q2JS9NRN
MRCK alpha
(Homo sapiens (Human))
BDBM25471
(N-[4-(pyridin-4-yl)phenyl]-2,3-dihydro-1,4-benzodi...)
Show SMILES O=C(Nc1ccc(cc1)-c1ccncc1)C1COc2ccccc2O1
Show InChI InChI=1S/C20H16N2O3/c23-20(19-13-24-17-3-1-2-4-18(17)25-19)22-16-7-5-14(6-8-16)15-9-11-21-12-10-15/h1-12,19H,13H2,(H,22,23)
n/an/a 7.05E+3n/an/an/an/a7.322
The Scripps Research Institute
Assay Description
The mixture of a S6-peptide, ATP, and test compound was added to the wells using a BioRAPTR FRD Workstation (Aurora Discovery). Reaction was started ...
J Med Chem 51: 6642-5 (2008)
Article DOI: 10.1021/jm800986w
BindingDB Entry DOI: 10.7270/Q2JS9NRN
cAMP-dependent protein kinase (PKA)
(Homo sapiens (Human))
BDBM25471
(N-[4-(pyridin-4-yl)phenyl]-2,3-dihydro-1,4-benzodi...)
Show SMILES O=C(Nc1ccc(cc1)-c1ccncc1)C1COc2ccccc2O1
Show InChI InChI=1S/C20H16N2O3/c23-20(19-13-24-17-3-1-2-4-18(17)25-19)22-16-7-5-14(6-8-16)15-9-11-21-12-10-15/h1-12,19H,13H2,(H,22,23)
NCI pathway
Reactome pathway
n/an/a 692n/an/an/an/a7.322
The Scripps Research Institute
Assay Description
Reaction mixture of kemptide, ATP, and test compound was added to the wells using a BioRAPTR FRD Workstation (Aurora Discovery). Reaction was started...
J Med Chem 51: 6642-5 (2008)
Article DOI: 10.1021/jm800986w
BindingDB Entry DOI: 10.7270/Q2JS9NRN