BDBM25498 4-(4-chloro-2-fluorophenyl)-N-(6-fluoro-1H-indazol-5-yl)-2-(2-methoxypyridin-4-yl)-6-methyl-1,4-dihydropyrimidine-5-carboxamide::Dihydropyrimidine, 27
SMILES: COc1cc(ccn1)C1=NC(C)=C(C(N1)c1ccc(Cl)cc1F)C(=O)Nc1cc2cn[nH]c2cc1F
InChI Key: InChIKey=TYHGSJHFMYWTNJ-UHFFFAOYSA-N
Data: 1 IC50
Activity Spreadsheet -- Enzyme Inhibition Constant Data from BindingDB
Found 1 hit for monomerid = 25498
Trg + Lig
Ki
nM
ΔG°
kcal/mole
IC50
nM
Kd
nM
EC50/IC50
nM
koff
s-1
kon
M-1s-1
pHTemp
°C
Rho-associated protein kinase 1
(Homo sapiens (Human))
BDBM25498
(4-(4-chloro-2-fluorophenyl)-N-(6-fluoro-1H-indazol...)
Show SMILES COc1cc(ccn1)C1=NC(C)=C(C(N1)c1ccc(Cl)cc1F)C(=O)Nc1cc2cn[nH]c2cc1F |c:12,t:9|
Show InChI InChI=1S/C25H19ClF2N6O2/c1-12-22(25(35)32-20-7-14-11-30-34-19(14)10-18(20)28)23(16-4-3-15(26)9-17(16)27)33-24(31-12)13-5-6-29-21(8-13)36-2/h3-11,23H,1-2H3,(H,30,34)(H,31,33)(H,32,35)
NCI pathway
Reactome pathway
n/an/a 6n/an/an/an/a7.422
GSK
Assay Description
The assay of Rock-1 activity involved incubation with peptide substrate and ATP33, and the incorporation of P33 into the peptide was quantified by Sc...
J Med Chem 51: 6631-4 (2008)
Article DOI: 10.1021/jm8005096
BindingDB Entry DOI: 10.7270/Q2F47MFZ