BDBM25509 1-(4-fluorophenyl)-3-methyl-N-[(1S)-1-phenylethyl]-1H-pyrazolo[4,3-c]pyridin-6-amine::2-amino-pyrazolopyridine, 14
SMILES: C[C@H](Nc1cc2n(nc(C)c2cn1)-c1ccc(F)cc1)c1ccccc1
InChI Key: InChIKey=LBPLOTUSSSOCHO-AWEZNQCLSA-N
Data: 1 IC50
Activity Spreadsheet -- Enzyme Inhibition Constant Data from BindingDB
Found 1 hit for monomerid = 25509
Trg + Lig
Ki
nM
ΔG°
kcal/mole
IC50
nM
Kd
nM
EC50/IC50
nM
koff
s-1
kon
M-1s-1
pHTemp
°C
Serine/threonine-protein kinase PLK1
(Homo sapiens (Human))
BDBM25509
(1-(4-fluorophenyl)-3-methyl-N-[(1S)-1-phenylethyl]...)
Show SMILES C[C@H](Nc1cc2n(nc(C)c2cn1)-c1ccc(F)cc1)c1ccccc1 |r|
Show InChI InChI=1S/C21H19FN4/c1-14(16-6-4-3-5-7-16)24-21-12-20-19(13-23-21)15(2)25-26(20)18-10-8-17(22)9-11-18/h3-14H,1-2H3,(H,23,24)/t14-/m0/s1
NCI pathway
Reactome pathway
n/an/a 3.24E+3n/an/an/an/a7.230
Sunesis Pharmaceuticals
Assay Description
An IMAP fluorescence polarization-based assay format (Molecular Devices) was used to determine the ability of compounds to inhibit the phosphorylatio...
Bioorg Med Chem Lett 18: 5648-52 (2008)
Article DOI: 10.1016/j.bmcl.2008.08.095
BindingDB Entry DOI: 10.7270/Q29C6VRP