BDBM25522 2-[3-chloro-5-(3-methyl-6-{[(1S)-1-phenylethyl]amino}-1H-pyrazolo[4,3-c]pyridin-1-yl)phenyl]benzamide::2-amino-pyrazolopyridine, 38
SMILES: C[C@H](Nc1cc2n(nc(C)c2cn1)-c1cc(Cl)cc(c1)-c1ccccc1C(N)=O)c1ccccc1
InChI Key: InChIKey=IFCBXJXWEYHVPY-KRWDZBQOSA-N
Data: 1 IC50
PDB links: 1 PDB ID matches this monomer.
Activity Spreadsheet -- Enzyme Inhibition Constant Data from BindingDB
Found 1 hit for monomerid = 25522
Trg + Lig
Ki
nM
ΔG°
kcal/mole
IC50
nM
Kd
nM
EC50/IC50
nM
koff
s-1
kon
M-1s-1
pHTemp
°C
Serine/threonine-protein kinase PLK1
(Homo sapiens (Human))
BDBM25522
(2-[3-chloro-5-(3-methyl-6-{[(1S)-1-phenylethyl]ami...)
Show SMILES C[C@H](Nc1cc2n(nc(C)c2cn1)-c1cc(Cl)cc(c1)-c1ccccc1C(N)=O)c1ccccc1 |r|
Show InChI InChI=1S/C28H24ClN5O/c1-17(19-8-4-3-5-9-19)32-27-15-26-25(16-31-27)18(2)33-34(26)22-13-20(12-21(29)14-22)23-10-6-7-11-24(23)28(30)35/h3-17H,1-2H3,(H2,30,35)(H,31,32)/t17-/m0/s1
NCI pathway
Reactome pathway
n/an/a 42n/an/an/an/a7.230
Sunesis Pharmaceuticals
Assay Description
An IMAP fluorescence polarization-based assay format (Molecular Devices) was used to determine the ability of compounds to inhibit the phosphorylatio...
Bioorg Med Chem Lett 18: 5648-52 (2008)
Article DOI: 10.1016/j.bmcl.2008.08.095
BindingDB Entry DOI: 10.7270/Q29C6VRP