BDBM25640 (1Z)-5-[1-(piperidin-3-ylmethyl)-3-(pyridin-4-yl)-1H-pyrazol-4-yl]-2,3-dihydro-1H-indene-1-hydroxylamine::pyrazole-based inhibitor, 22
SMILES: O=NC1CCc2cc(ccc12)-c1cn(CC2CCCNC2)nc1-c1ccncc1
InChI Key: InChIKey=YLWQVOLMOFXGGH-UHFFFAOYSA-N
Data: 1 IC50
Activity Spreadsheet -- Enzyme Inhibition Constant Data from BindingDB
Found 1 hit for monomerid = 25640
Trg + Lig
Ki
nM
ΔG°
kcal/mole
IC50
nM
Kd
nM
EC50/IC50
nM
koff
s-1
kon
M-1s-1
pHTemp
°C
Serine/threonine-protein kinase B-raf
(Homo sapiens (Human))
BDBM25640
((1Z)-5-[1-(piperidin-3-ylmethyl)-3-(pyridin-4-yl)-...)
Show SMILES O=NC1CCc2cc(ccc12)-c1cn(CC2CCCNC2)nc1-c1ccncc1
Show InChI InChI=1S/C23H25N5O/c29-27-22-6-4-18-12-19(3-5-20(18)22)21-15-28(14-16-2-1-9-25-13-16)26-23(21)17-7-10-24-11-8-17/h3,5,7-8,10-12,15-16,22,25H,1-2,4,6,9,13-14H2
NCI pathway
Reactome pathway
n/an/a 0.850n/an/an/an/a7.222
Array BioPharma
Assay Description
Activity of human recombinant B-Raf protein was assessed in vitro by assay of the incorporation of radiolabeled phosphate to recombinant MAP kinase (...
Bioorg Med Chem Lett 18: 4692-5 (2008)
Article DOI: 10.1016/j.bmcl.2008.07.002
BindingDB Entry DOI: 10.7270/Q2NK3CBJ