BDBM25641 3-{4-[(1Z)-1-(hydroxyimino)-2,3-dihydro-1H-inden-5-yl]-3-(pyridin-4-yl)-1H-pyrazol-1-yl}-N-methylcyclohexan-1-amine::pyrazole-based inhibitor, 23
SMILES: CNC1CCCC(C1)n1cc(c(n1)-c1ccncc1)-c1ccc2C(CCc2c1)N=O
InChI Key: InChIKey=NNFRBCFFCSKCFE-UHFFFAOYSA-N
Data: 1 IC50
Activity Spreadsheet -- Enzyme Inhibition Constant Data from BindingDB
Found 1 hit for monomerid = 25641
Trg + Lig
Ki
nM
ΔG°
kcal/mole
IC50
nM
Kd
nM
EC50/IC50
nM
koff
s-1
kon
M-1s-1
pHTemp
°C
Serine/threonine-protein kinase B-raf
(Homo sapiens (Human))
BDBM25641
(3-{4-[(1Z)-1-(hydroxyimino)-2,3-dihydro-1H-inden-5...)
Show SMILES CNC1CCCC(C1)n1cc(c(n1)-c1ccncc1)-c1ccc2C(CCc2c1)N=O
Show InChI InChI=1S/C24H27N5O/c1-25-19-3-2-4-20(14-19)29-15-22(24(27-29)16-9-11-26-12-10-16)18-5-7-21-17(13-18)6-8-23(21)28-30/h5,7,9-13,15,19-20,23,25H,2-4,6,8,14H2,1H3
NCI pathway
Reactome pathway
n/an/a 0.230n/an/an/an/a7.222
Array BioPharma
Assay Description
Activity of human recombinant B-Raf protein was assessed in vitro by assay of the incorporation of radiolabeled phosphate to recombinant MAP kinase (...
Bioorg Med Chem Lett 18: 4692-5 (2008)
Article DOI: 10.1016/j.bmcl.2008.07.002
BindingDB Entry DOI: 10.7270/Q2NK3CBJ