BDBM25646 4-{4-[(1Z)-1-(hydroxyimino)-2,3-dihydro-1H-inden-5-yl]-1-methyl-1H-pyrazol-3-yl}pyridin-3-ol::pyrazole-based inhibitor, 28
SMILES: Cn1cc(c(n1)-c1ccncc1O)-c1ccc2C(CCc2c1)N=O
InChI Key: InChIKey=KLWOACDZIMMYOP-UHFFFAOYSA-N
Data: 1 IC50
Activity Spreadsheet -- Enzyme Inhibition Constant Data from BindingDB
Found 1 hit for monomerid = 25646
Trg + Lig
Ki
nM
ΔG°
kcal/mole
IC50
nM
Kd
nM
EC50/IC50
nM
koff
s-1
kon
M-1s-1
pHTemp
°C
Serine/threonine-protein kinase B-raf
(Homo sapiens (Human))
BDBM25646
(4-{4-[(1Z)-1-(hydroxyimino)-2,3-dihydro-1H-inden-5...)
Show SMILES Cn1cc(c(n1)-c1ccncc1O)-c1ccc2C(CCc2c1)N=O
Show InChI InChI=1S/C18H16N4O2/c1-22-10-15(18(20-22)14-6-7-19-9-17(14)23)12-2-4-13-11(8-12)3-5-16(13)21-24/h2,4,6-10,16,23H,3,5H2,1H3
NCI pathway
Reactome pathway
n/an/a 2.90n/an/an/an/a7.222
Array BioPharma
Assay Description
Activity of human recombinant B-Raf protein was assessed in vitro by assay of the incorporation of radiolabeled phosphate to recombinant MAP kinase (...
Bioorg Med Chem Lett 18: 4692-5 (2008)
Article DOI: 10.1016/j.bmcl.2008.07.002
BindingDB Entry DOI: 10.7270/Q2NK3CBJ