BDBM2586 3,4-Bis(3-indolyl)-3-pyrrolin-2-one::3,4-bis(1H-indol-3-yl)-2,5-dihydro-1H-pyrrol-2-one::Bisindolyl deriv. 8::Bisindolylmaleimide deriv. 8
SMILES: O=C1NCC(=C1c1c[nH]c2ccccc12)c1c[nH]c2ccccc12
InChI Key: InChIKey=BLWFEWHEZAZRFX-UHFFFAOYSA-N
Data: 2 IC50
PDB links: 9 PDB IDs contain this monomer as substructures.
Activity Spreadsheet -- Enzyme Inhibition Constant Data from BindingDB
Found 2 hits for monomerid = 2586
Trg + Lig
Ki
nM
ΔG°
kcal/mole
IC50
nM
Kd
nM
EC50/IC50
nM
koff
s-1
kon
M-1s-1
pHTemp
°C
cAMP-Dependent Protein Kinase (PKA)
(Bos taurus (bovine))
BDBM2586
(3,4-Bis(3-indolyl)-3-pyrrolin-2-one | 3,4-bis(1H-i...)
Show SMILES O=C1NCC(=C1c1c[nH]c2ccccc12)c1c[nH]c2ccccc12 |c:4|
Show InChI InChI=1S/C20H15N3O/c24-20-19(15-10-22-18-8-4-2-6-13(15)18)16(11-23-20)14-9-21-17-7-3-1-5-12(14)17/h1-10,21-22H,11H2,(H,23,24)
n/an/a 2.00E+3n/an/an/an/a7.430
Laboratoires Glaxo
Assay Description
IC50 is the inhibitor concentration which inhibits 50% of kinase activity that catalyzes the transfer of the terminal phosphate from [gamma-32P] labe...
J Biol Chem 266: 15771-81 (1991)
BindingDB Entry DOI: 10.7270/Q2FF3QJ4
Protein Kinase C
(Rattus norvegicus (rat))
BDBM2586
(3,4-Bis(3-indolyl)-3-pyrrolin-2-one | 3,4-bis(1H-i...)
Show SMILES O=C1NCC(=C1c1c[nH]c2ccccc12)c1c[nH]c2ccccc12 |c:4|
Show InChI InChI=1S/C20H15N3O/c24-20-19(15-10-22-18-8-4-2-6-13(15)18)16(11-23-20)14-9-21-17-7-3-1-5-12(14)17/h1-10,21-22H,11H2,(H,23,24)
n/an/a 1.03E+4n/an/an/an/a7.530
Roche Products Limited
Assay Description
The activity of PKC, activated by phosphatidylerine and Ca2+, is measured by its ability to transfer phosphate from [gamma-32P]ATP to lysine-rich his...
J Med Chem 35: 177-84 (1992)
Article DOI: 10.1021/jm00079a024
BindingDB Entry DOI: 10.7270/Q2K64G8V