BDBM26247 N-[2-(3,5-dimethyl-1H-pyrazol-1-yl)-6-[6-(morpholin-4-yl)pyridin-2-yl]pyrimidin-4-yl]acetamide::pyrazolylpyrimidine derivative, 16a
SMILES: CC(=O)Nc1cc(nc(n1)-n1nc(C)cc1C)-c1cccc(n1)N1CCOCC1
InChI Key: InChIKey=ONJXHXVTYOPVIN-UHFFFAOYSA-N
Data: 2 KI
Activity Spreadsheet -- Enzyme Inhibition Constant Data from BindingDB
Found 2 hits for monomerid = 26247
Trg + Lig
Ki
nM
ΔG°
kcal/mole
IC50
nM
Kd
nM
EC50/IC50
nM
koff
s-1
kon
M-1s-1
pHTemp
°C
Adenosine receptor A2a
(Homo sapiens (Human))
BDBM26247
(N-[2-(3,5-dimethyl-1H-pyrazol-1-yl)-6-[6-(morpholi...)
Show SMILES CC(=O)Nc1cc(nc(n1)-n1nc(C)cc1C)-c1cccc(n1)N1CCOCC1
Show InChI InChI=1S/C20H23N7O2/c1-13-11-14(2)27(25-13)20-23-17(12-18(24-20)21-15(3)28)16-5-4-6-19(22-16)26-7-9-29-10-8-26/h4-6,11-12H,7-10H2,1-3H3,(H,21,23,24,28)
NCI pathway
Reactome pathway
0.830 -12.3n/an/an/an/an/a7.422
Neurocrine Bioscience
Assay Description
The membranes prepared from HEK cells transfected with adenosine receptors were used in binding assays. Nonspecific binding was determined in the pre...
J Med Chem 51: 7099-7110 (2008)
Article DOI: 10.1021/jm800851u
BindingDB Entry DOI: 10.7270/Q20R9MQG
Adenosine receptor A1
(Homo sapiens (Human))
BDBM26247
(N-[2-(3,5-dimethyl-1H-pyrazol-1-yl)-6-[6-(morpholi...)
Show SMILES CC(=O)Nc1cc(nc(n1)-n1nc(C)cc1C)-c1cccc(n1)N1CCOCC1
Show InChI InChI=1S/C20H23N7O2/c1-13-11-14(2)27(25-13)20-23-17(12-18(24-20)21-15(3)28)16-5-4-6-19(22-16)26-7-9-29-10-8-26/h4-6,11-12H,7-10H2,1-3H3,(H,21,23,24,28)
Reactome pathway
130n/an/an/an/an/an/an/an/a
Neurocrine Bioscience
Assay Description
The membranes prepared from HEK cells transfected with adenosine receptors were used in binding assays. Nonspecific binding was determined in the pre...
J Med Chem 51: 7099-7110 (2008)
Article DOI: 10.1021/jm800851u
BindingDB Entry DOI: 10.7270/Q20R9MQG