BDBM26275 N-(4-fluorophenyl)-2-{3-[(7-{3-[4-(hydroxymethyl)piperidin-1-yl]propoxy}-6-methoxyquinazolin-4-yl)amino]-1H-pyrazol-5-yl}acetamide::pyrazoloquinazoline deriv., 9
SMILES: COc1cc2c(Nc3cc(CC(=O)Nc4ccc(F)cc4)n[nH]3)ncnc2cc1OCCCN1CCC(CO)CC1
InChI Key: InChIKey=GQVQUORGWXYGNR-UHFFFAOYSA-N
Data: 2 KI
Activity Spreadsheet -- Enzyme Inhibition Constant Data from BindingDB
Found 2 hits for monomerid = 26275
Trg + Lig
Ki
nM
ΔG°
kcal/mole
IC50
nM
Kd
nM
EC50/IC50
nM
koff
s-1
kon
M-1s-1
pHTemp
°C
Aurora kinase B
(Homo sapiens (Human))
BDBM26275
(N-(4-fluorophenyl)-2-{3-[(7-{3-[4-(hydroxymethyl)p...)
Show SMILES COc1cc2c(Nc3cc(CC(=O)Nc4ccc(F)cc4)n[nH]3)ncnc2cc1OCCCN1CCC(CO)CC1
Show InChI InChI=1S/C29H34FN7O4/c1-40-25-15-23-24(16-26(25)41-12-2-9-37-10-7-19(17-38)8-11-37)31-18-32-29(23)34-27-13-22(35-36-27)14-28(39)33-21-5-3-20(30)4-6-21/h3-6,13,15-16,18-19,38H,2,7-12,14,17H2,1H3,(H,33,39)(H2,31,32,34,35,36)
Reactome pathway
30 -10.2n/an/an/an/an/a7.522
AstraZeneca
Assay Description
In vitro kinase assay using recombinant Aurora B bound to INCENP was incubated at room temperature with substrate, and test compounds in the presence...
J Med Chem 50: 2213-24 (2007)
Article DOI: 10.1021/jm061335f
BindingDB Entry DOI: 10.7270/Q2GQ6W24
Aurora kinase A
(Homo sapiens (Human))
BDBM26275
(N-(4-fluorophenyl)-2-{3-[(7-{3-[4-(hydroxymethyl)p...)
Show SMILES COc1cc2c(Nc3cc(CC(=O)Nc4ccc(F)cc4)n[nH]3)ncnc2cc1OCCCN1CCC(CO)CC1
Show InChI InChI=1S/C29H34FN7O4/c1-40-25-15-23-24(16-26(25)41-12-2-9-37-10-7-19(17-38)8-11-37)31-18-32-29(23)34-27-13-22(35-36-27)14-28(39)33-21-5-3-20(30)4-6-21/h3-6,13,15-16,18-19,38H,2,7-12,14,17H2,1H3,(H,33,39)(H2,31,32,34,35,36)
NCI pathway
Reactome pathway
2.00E+3 -7.77n/an/an/an/an/an/a25
AstraZeneca
Assay Description
In vitro kinase assay using recombinant Aurora A purified from Sf9 cells was incubated at room temperature with substrate, and test compounds in the ...
J Med Chem 50: 2213-24 (2007)
Article DOI: 10.1021/jm061335f
BindingDB Entry DOI: 10.7270/Q2GQ6W24