BDBM26288 N-(2,3-difluorophenyl)-2-{3-[(7-{3-[4-(2-hydroxyethyl)piperidin-1-yl]propoxy}-6-methoxyquinazolin-4-yl)amino]-1H-pyrazol-5-yl}acetamide::pyrazoloquinazoline deriv., 22
SMILES: COc1cc2c(Nc3cc(CC(=O)Nc4cccc(F)c4F)n[nH]3)ncnc2cc1OCCCN1CCC(CCO)CC1
InChI Key: InChIKey=KGXUJVJQAAUOTC-UHFFFAOYSA-N
Data: 2 KI
Activity Spreadsheet -- Enzyme Inhibition Constant Data from BindingDB
Found 2 hits for monomerid = 26288
Trg + Lig
Ki
nM
ΔG°
kcal/mole
IC50
nM
Kd
nM
EC50/IC50
nM
koff
s-1
kon
M-1s-1
pHTemp
°C
Aurora kinase B
(Homo sapiens (Human))
BDBM26288
(N-(2,3-difluorophenyl)-2-{3-[(7-{3-[4-(2-hydroxyet...)
Show SMILES COc1cc2c(Nc3cc(CC(=O)Nc4cccc(F)c4F)n[nH]3)ncnc2cc1OCCCN1CCC(CCO)CC1
Show InChI InChI=1S/C30H35F2N7O4/c1-42-25-16-21-24(17-26(25)43-13-3-9-39-10-6-19(7-11-39)8-12-40)33-18-34-30(21)36-27-14-20(37-38-27)15-28(41)35-23-5-2-4-22(31)29(23)32/h2,4-5,14,16-19,40H,3,6-13,15H2,1H3,(H,35,41)(H2,33,34,36,37,38)
Reactome pathway
<1<-12.1n/an/an/an/an/a7.522
AstraZeneca
Assay Description
In vitro kinase assay using recombinant Aurora B bound to INCENP was incubated at room temperature with substrate, and test compounds in the presence...
J Med Chem 50: 2213-24 (2007)
Article DOI: 10.1021/jm061335f
BindingDB Entry DOI: 10.7270/Q2GQ6W24
Aurora kinase A
(Homo sapiens (Human))
BDBM26288
(N-(2,3-difluorophenyl)-2-{3-[(7-{3-[4-(2-hydroxyet...)
Show SMILES COc1cc2c(Nc3cc(CC(=O)Nc4cccc(F)c4F)n[nH]3)ncnc2cc1OCCCN1CCC(CCO)CC1
Show InChI InChI=1S/C30H35F2N7O4/c1-42-25-16-21-24(17-26(25)43-13-3-9-39-10-6-19(7-11-39)8-12-40)33-18-34-30(21)36-27-14-20(37-38-27)15-28(41)35-23-5-2-4-22(31)29(23)32/h2,4-5,14,16-19,40H,3,6-13,15H2,1H3,(H,35,41)(H2,33,34,36,37,38)
NCI pathway
Reactome pathway
280 -8.93n/an/an/an/an/an/a25
AstraZeneca
Assay Description
In vitro kinase assay using recombinant Aurora A purified from Sf9 cells was incubated at room temperature with substrate, and test compounds in the ...
J Med Chem 50: 2213-24 (2007)
Article DOI: 10.1021/jm061335f
BindingDB Entry DOI: 10.7270/Q2GQ6W24