BDBM26506 BMCL193669 Compound 24::N-[(2S,3R)-4-[(2,6-dimethylheptan-2-yl)amino]-3-hydroxy-1-phenylbutan-2-yl]-3-ethyl-9-methyl-10,10-dioxo-10-thia-1,9-diazatricyclo[6.4.1.0^{4,13}]trideca-2,4(13),5,7-tetraene-6-carboxamide::tricyclic hydroxyethylamine (HEA) derivative, 8c
SMILES: CCc1cn2CCS(=O)(=O)N(C)c3cc(cc1c23)C(=O)N[C@@H](Cc1ccccc1)[C@H](O)CNC(C)(C)CCCC(C)C
InChI Key: InChIKey=WICLUVROROXQTO-MFMCTBQISA-N
Data: 6 IC50
Activity Spreadsheet -- Enzyme Inhibition Constant Data from BindingDB
Found 6 hits for monomerid = 26506
Trg + Lig
Ki
nM
ΔG°
kcal/mole
IC50
nM
Kd
nM
EC50/IC50
nM
koff
s-1
kon
M-1s-1
pHTemp
°C
Beta-secretase 1
(Homo sapiens (Human))
BDBM26506
(BMCL193669 Compound 24 | N-[(2S,3R)-4-[(2,6-dimeth...)
Show SMILES CCc1cn2CCS(=O)(=O)N(C)c3cc(cc1c23)C(=O)N[C@@H](Cc1ccccc1)[C@H](O)CNC(C)(C)CCCC(C)C |r|
Show InChI InChI=1S/C33H48N4O4S/c1-7-25-22-37-16-17-42(40,41)36(6)29-20-26(19-27(25)31(29)37)32(39)35-28(18-24-13-9-8-10-14-24)30(38)21-34-33(4,5)15-11-12-23(2)3/h8-10,13-14,19-20,22-23,28,30,34,38H,7,11-12,15-18,21H2,1-6H3,(H,35,39)/t28-,30+/m0/s1
n/an/a 5n/an/an/an/a4.522
GSK
Assay Description
Enzyme activity and inhibition were assayed using a fluorescent FAM-[SEVNLDAEFK]-TAMRA substrate. Control reactions with no enzyme were included in e...
J Med Chem 51: 3313-7 (2008)
Article DOI: 10.1021/jm800138h
BindingDB Entry DOI: 10.7270/Q2XS5SQR
Beta-secretase 2
(Homo sapiens (Human))
BDBM26506
(BMCL193669 Compound 24 | N-[(2S,3R)-4-[(2,6-dimeth...)
Show SMILES CCc1cn2CCS(=O)(=O)N(C)c3cc(cc1c23)C(=O)N[C@@H](Cc1ccccc1)[C@H](O)CNC(C)(C)CCCC(C)C |r|
Show InChI InChI=1S/C33H48N4O4S/c1-7-25-22-37-16-17-42(40,41)36(6)29-20-26(19-27(25)31(29)37)32(39)35-28(18-24-13-9-8-10-14-24)30(38)21-34-33(4,5)15-11-12-23(2)3/h8-10,13-14,19-20,22-23,28,30,34,38H,7,11-12,15-18,21H2,1-6H3,(H,35,39)/t28-,30+/m0/s1
n/an/a 114n/an/an/an/a4.522
GSK
Assay Description
Enzyme activity and inhibition were assayed using a fluorescent FAM-[SEVNLDAEFK]-TAMRA substrate. Control reactions with no enzyme were included in e...
J Med Chem 51: 3313-7 (2008)
Article DOI: 10.1021/jm800138h
BindingDB Entry DOI: 10.7270/Q2XS5SQR
Cathepsin D
(Homo sapiens (Human))
BDBM26506
(BMCL193669 Compound 24 | N-[(2S,3R)-4-[(2,6-dimeth...)
Show SMILES CCc1cn2CCS(=O)(=O)N(C)c3cc(cc1c23)C(=O)N[C@@H](Cc1ccccc1)[C@H](O)CNC(C)(C)CCCC(C)C |r|
Show InChI InChI=1S/C33H48N4O4S/c1-7-25-22-37-16-17-42(40,41)36(6)29-20-26(19-27(25)31(29)37)32(39)35-28(18-24-13-9-8-10-14-24)30(38)21-34-33(4,5)15-11-12-23(2)3/h8-10,13-14,19-20,22-23,28,30,34,38H,7,11-12,15-18,21H2,1-6H3,(H,35,39)/t28-,30+/m0/s1
NCI pathway
Reactome pathway
n/an/a 1.00E+3n/an/an/an/an/an/a
GSK
Assay Description
Enzyme activity and inhibition were assayed using a fluorescent FAM-[SEVNLDAEFK]-TAMRA substrate. Control reactions with no enzyme were included in e...
Bioorg Med Chem Lett 19: 3669-73 (2009)
Article DOI: 10.1016/j.bmcl.2009.03.150
BindingDB Entry DOI: 10.7270/Q29885BR
Beta-secretase 1
(Homo sapiens (Human))
BDBM26506
(BMCL193669 Compound 24 | N-[(2S,3R)-4-[(2,6-dimeth...)
Show SMILES CCc1cn2CCS(=O)(=O)N(C)c3cc(cc1c23)C(=O)N[C@@H](Cc1ccccc1)[C@H](O)CNC(C)(C)CCCC(C)C |r|
Show InChI InChI=1S/C33H48N4O4S/c1-7-25-22-37-16-17-42(40,41)36(6)29-20-26(19-27(25)31(29)37)32(39)35-28(18-24-13-9-8-10-14-24)30(38)21-34-33(4,5)15-11-12-23(2)3/h8-10,13-14,19-20,22-23,28,30,34,38H,7,11-12,15-18,21H2,1-6H3,(H,35,39)/t28-,30+/m0/s1
n/an/a 5n/an/an/an/a4.522
GSK
Assay Description
Enzyme activity and inhibition were assayed using a fluorescent FAM-[SEVNLDAEFK]-TAMRA substrate. Control reactions with no enzyme were included in e...
Bioorg Med Chem Lett 19: 3669-73 (2009)
Article DOI: 10.1016/j.bmcl.2009.03.150
BindingDB Entry DOI: 10.7270/Q29885BR
Beta-secretase 2
(Homo sapiens (Human))
BDBM26506
(BMCL193669 Compound 24 | N-[(2S,3R)-4-[(2,6-dimeth...)
Show SMILES CCc1cn2CCS(=O)(=O)N(C)c3cc(cc1c23)C(=O)N[C@@H](Cc1ccccc1)[C@H](O)CNC(C)(C)CCCC(C)C |r|
Show InChI InChI=1S/C33H48N4O4S/c1-7-25-22-37-16-17-42(40,41)36(6)29-20-26(19-27(25)31(29)37)32(39)35-28(18-24-13-9-8-10-14-24)30(38)21-34-33(4,5)15-11-12-23(2)3/h8-10,13-14,19-20,22-23,28,30,34,38H,7,11-12,15-18,21H2,1-6H3,(H,35,39)/t28-,30+/m0/s1
n/an/a 110n/an/an/an/an/an/a
GSK
Assay Description
Enzyme activity and inhibition were assayed using a fluorescent FAM-[SEVNLDAEFK]-TAMRA substrate. Control reactions with no enzyme were included in e...
Bioorg Med Chem Lett 19: 3669-73 (2009)
Article DOI: 10.1016/j.bmcl.2009.03.150
BindingDB Entry DOI: 10.7270/Q29885BR
Cathepsin D
(Homo sapiens (Human))
BDBM26506
(BMCL193669 Compound 24 | N-[(2S,3R)-4-[(2,6-dimeth...)
Show SMILES CCc1cn2CCS(=O)(=O)N(C)c3cc(cc1c23)C(=O)N[C@@H](Cc1ccccc1)[C@H](O)CNC(C)(C)CCCC(C)C |r|
Show InChI InChI=1S/C33H48N4O4S/c1-7-25-22-37-16-17-42(40,41)36(6)29-20-26(19-27(25)31(29)37)32(39)35-28(18-24-13-9-8-10-14-24)30(38)21-34-33(4,5)15-11-12-23(2)3/h8-10,13-14,19-20,22-23,28,30,34,38H,7,11-12,15-18,21H2,1-6H3,(H,35,39)/t28-,30+/m0/s1
NCI pathway
Reactome pathway
n/an/a 1.00E+3n/an/an/an/an/an/a
GSK
Assay Description
Enzyme activity and inhibition were assayed using a fluorescent FAM-[SEVNLDAEFK]-TAMRA substrate. Control reactions with no enzyme were included in e...
J Med Chem 51: 3313-7 (2008)
Article DOI: 10.1021/jm800138h
BindingDB Entry DOI: 10.7270/Q2XS5SQR