BDBM26708 N-[4-(6-methyl-1,3-benzothiazol-2-yl)phenyl]-1-(thiophene-2-sulfonyl)piperidine-4-carboxamide::benzothiazole analogue, 3
SMILES: Cc1ccc2nc(sc2c1)-c1ccc(NC(=O)C2CCN(CC2)S(=O)(=O)c2cccs2)cc1
InChI Key: InChIKey=IVGKSFUEBSXSAE-UHFFFAOYSA-N
Data: 2 IC50
Activity Spreadsheet -- Enzyme Inhibition Constant Data from BindingDB
Found 2 hits for monomerid = 26708
Trg + Lig
Ki
nM
ΔG°
kcal/mole
IC50
nM
Kd
nM
EC50/IC50
nM
koff
s-1
kon
M-1s-1
pHTemp
°C
Fatty-acid amide hydrolase 1
(Homo sapiens (Human))
BDBM26708
(N-[4-(6-methyl-1,3-benzothiazol-2-yl)phenyl]-1-(th...)
Show SMILES Cc1ccc2nc(sc2c1)-c1ccc(NC(=O)C2CCN(CC2)S(=O)(=O)c2cccs2)cc1
Show InChI InChI=1S/C24H23N3O3S3/c1-16-4-9-20-21(15-16)32-24(26-20)18-5-7-19(8-6-18)25-23(28)17-10-12-27(13-11-17)33(29,30)22-3-2-14-31-22/h2-9,14-15,17H,10-13H2,1H3,(H,25,28)
n/an/a 18n/an/an/an/an/an/a
The Scripps Research Institute
Curated by ChEMBL
Assay Description
Inhibition of FAAH
Bioorg Med Chem Lett 21: 4674-85 (2011)
Article DOI: 10.1016/j.bmcl.2011.06.096
BindingDB Entry DOI: 10.7270/Q2W959JK
Fatty-acid amide hydrolase 1 (aa 30-579)
(Rattus norvegicus (rat))
BDBM26708
(N-[4-(6-methyl-1,3-benzothiazol-2-yl)phenyl]-1-(th...)
Show SMILES Cc1ccc2nc(sc2c1)-c1ccc(NC(=O)C2CCN(CC2)S(=O)(=O)c2cccs2)cc1
Show InChI InChI=1S/C24H23N3O3S3/c1-16-4-9-20-21(15-16)32-24(26-20)18-5-7-19(8-6-18)25-23(28)17-10-12-27(13-11-17)33(29,30)22-3-2-14-31-22/h2-9,14-15,17H,10-13H2,1H3,(H,25,28)
n/an/a 18n/an/an/an/a8.022
Abbott Laboratories
Assay Description
[3H]anandamide was incubated with membranes to produce radiolabeled ethanolamine and unlabeled arachidonic acid. Charcoal selectively binds anandamid...
J Med Chem 52: 170-80 (2009)
Article DOI: 10.1021/jm801042a
BindingDB Entry DOI: 10.7270/Q24B2ZMQ